{"text_format":"1","workbook":"xlsx","n_sheets":8,"sheets":["Entry form","Entry form Page 2","Fee","INFO","Instructions","Tournament info","Sheet1","Sheet2"],"not_rendered":{"charts":0,"images":1,"macros":1,"external_links":0,"defined_names":18,"comments":0,"pivot_tables":0},"unopened":[],"bounds":{"document_bytes":16777216,"sheet_cells":100000,"rows_first":2000,"rows_last":500,"rows_between":2000,"halvings":0,"cell_chars":16384,"cell_head_chars":4096},"cells_cut":0,"cells_raw":0,"read":"whole","date_system":"1900"}

{"sheet":"Entry form","index":0,"n_rows":111,"n_cols":22,"rows_kept":111,"cut":false,"hidden":false,"merged":[[10,3,10,5],[1,3,1,5],[2,3,2,5],[3,3,3,5],[4,3,4,5],[5,3,5,5],[6,3,6,5],[7,3,7,5],[8,2,9,2],[8,3,8,5],[9,3,9,5],[0,16,0,18],[0,10,0,13]]}
[null,null,"Karate League Entry Form",null,null,null,null,null,null,null,{"$f":"\"  \"&+'Tournament info'!E4","v":"  LIONS Challenge"},null,null,null,null,null,{"$f":"+'Tournament info'!C6","v":"2015-08-15"}]
[null,null,"Club:",null,null,null,null,null,"Are you WKF affiliated?",null,null,null,"Name",null,null,null,{"$f":"+'Tournament info'!C2","v":"2015-11-01"}]
[null,null,"Contact Person:",null,null,null,null,null,null,null,null,"Referees:"]
[null,null,"Tel No:",null,null,null,null,null,"YES"]
[null,null,"E-Mail:"]
[null,null,"Payment Details:",null,null,null,null,null,"NO"]
[null,null,"Team Manager:"]
[null,null,"Coaches:",null,null,null,null,null,null,null,null,"Table Officails:"]
[]
[]
[]
[null,null,null,null,"Total Entries:",{"$f":"COUNTA(C22:C103)+'Entry form Page 2'!F12","v":0},null,null,null,null,null,"Contestants:",{"$f":"MAX(B22:B103)+'Entry form Page 2'!M12","v":0}]
[null,null,null,null,"Payment Due:",{"$f":"SUM(R22:R104)+'Entry form Page 2'!F13","v":0},null,null,null,null,null,"Discount",{"$f":"IF(M12>40,15%,IF(M12>25,10%,IF(M12>15,5%,0%)))*F13","v":0},null,null,null,"Nett Payable:",null,{"$f":"+F13-M13","v":0}]
[]
[null,null,"Name","DOB (dd/mm/yy)","Gender","Age","Belt ",null,"Club","Category","Event","Division (* - For Points)","Weight Category","Category","Kata","Kumite","Fee category","Fee ","Team Name"]
{"$rows_left_out":97}
{"sheet":"Entry form Page 2","index":1,"n_rows":111,"n_cols":22,"rows_kept":111,"cut":false,"hidden":false,"merged":[[0,10,0,13],[1,3,1,5],[0,16,0,18],[8,2,9,2],[8,3,8,5],[9,3,9,5],[10,3,10,5],[2,3,2,5],[3,3,3,5],[4,3,4,5],[5,3,5,5],[6,3,6,5],[7,3,7,5]]}
[null,null,"Karate League Entry Form",null,null,null,null,null,null,null,{"$f":"+'Entry form'!K1:N1","v":"  LIONS Challenge"},null,null,null,null,null,{"$f":"+'Entry form'!Q1:S1","v":"2015-08-15"}]
[null,null,"Club:",{"$f":"+'Entry form'!D2:F2","v":0},null,null,null,null,"Are you WKF affiliated?",null,null,null,"Name",null,null,null,{"$f":"+'Entry form'!Q2","v":"2015-11-01"}]
[null,null,"Contact Person:",{"$f":"+'Entry form'!D3:F3","v":0},null,null,null,null,null,null,null,"Referees:",{"$f":"+'Entry form'!M3","v":0}]
[null,null,"Tel No:",{"$f":"+'Entry form'!D4:F4","v":0},null,null,null,null,"YES",null,null,null,{"$f":"+'Entry form'!M4","v":0}]
[null,null,"E-Mail:",{"$f":"+'Entry form'!D5:F5","v":0},null,null,null,null,null,null,null,null,{"$f":"+'Entry form'!M5","v":0}]
[null,null,"Payment Details:",{"$f":"+'Entry form'!D6:F6","v":0},null,null,null,null,"NO",null,null,null,{"$f":"+'Entry form'!M6","v":0}]
[null,null,"Team Manager:",{"$f":"+'Entry form'!D7:F7","v":0},null,null,null,null,null,null,null,null,{"$f":"+'Entry form'!M7","v":0}]
[null,null,"Coaches:",{"$f":"+'Entry form'!D8:F8","v":0},null,null,null,null,null,null,null,"Table Officails:",{"$f":"+'Entry form'!M8","v":0}]
[null,null,null,{"$f":"+'Entry form'!D9:F9","v":0},null,null,null,null,null,null,null,null,{"$f":"+'Entry form'!M9","v":0}]
[null,null,null,{"$f":"+'Entry form'!D10:F10","v":0},null,null,null,null,null,null,null,null,{"$f":"+'Entry form'!M10","v":0}]
[null,null,null,{"$f":"+'Entry form'!D11:F11","v":0},null,null,null,null,null,null,null,null,{"$f":"+'Entry form'!M11","v":0}]
[null,null,null,null,"Total Entries:",{"$f":"COUNTA(C22:C103)","v":0},null,null,null,null,null,"Contestants:",{"$f":"MAX(B22:B103)","v":0}]
[null,null,null,null,"Payment Due:",{"$f":"SUM(R22:R104)","v":0},null,null,null,null,null,"Discount",null,null,null,null,"Nett Payable:",null,{"$f":"+F13-M13","v":0}]
[]
[null,null,"Name","DOB (dd/mm/yy)","Gender","Age","Belt ",null,"Club","Category","Event","Division (* - For Points)","Weight Category","Category","Kata","Kumite","Fee category","Fee ","Team Name"]
{"$rows_left_out":97}
{"sheet":"Fee","index":2,"n_rows":166,"n_cols":5,"rows_kept":166,"cut":false,"hidden":false,"merged":[]}
[null,"Total",{"$f":"SUM(C4:C166)","v":0},{"$f":"SUM(D4:D166)","v":0},0]
[]
[null,"Name of competitor","Fee Due","Fee Paid","Balance"]
[1,{"$f":"IFERROR(IF(VLOOKUP($A4,'Entry form'!$B$22:$R$103,2,0)=\"\",\"\",VLOOKUP($A4,'Entry form'!$B$22:$R$103,2,0)),\"\")","v":""},{"$f":"SUMIF('Entry form'!$C$22:$C$103,$B4,'Entry form'!$R$22:$R$103)","v":0},null,{"$f":"IF(C4=\"\",\"\",C4-D4)","v":0}]
[{"$f":"+A4+1","v":2},{"$f":"IFERROR(IF(VLOOKUP($A5,'Entry form'!$B$22:$R$103,2,0)=\"\",\"\",VLOOKUP($A5,'Entry form'!$B$22:$R$103,2,0)),\"\")","v":""},{"$f":"SUMIF('Entry form'!$C$22:$C$103,$B5,'Entry form'!$R$22:$R$103)","v":0},null,{"$f":"IF(C5=\"\",\"\",C5-D5)","v":0}]
[{"$f":"+A5+1","v":3},{"$f":"IFERROR(IF(VLOOKUP($A6,'Entry form'!$B$22:$R$103,2,0)=\"\",\"\",VLOOKUP($A6,'Entry form'!$B$22:$R$103,2,0)),\"\")","v":""},{"$f":"SUMIF('Entry form'!$C$22:$C$103,$B6,'Entry form'!$R$22:$R$103)","v":0},null,0]
[4,{"$f":"IFERROR(IF(VLOOKUP($A7,'Entry form'!$B$22:$R$103,2,0)=\"\",\"\",VLOOKUP($A7,'Entry form'!$B$22:$R$103,2,0)),\"\")","v":""},{"$f":"SUMIF('Entry form'!$C$22:$C$103,$B7,'Entry form'!$R$22:$R$103)","v":0},null,0]
[5,{"$f":"IFERROR(IF(VLOOKUP($A8,'Entry form'!$B$22:$R$103,2,0)=\"\",\"\",VLOOKUP($A8,'Entry form'!$B$22:$R$103,2,0)),\"\")","v":""},{"$f":"SUMIF('Entry form'!$C$22:$C$103,$B8,'Entry form'!$R$22:$R$103)","v":0},null,0]
[6,{"$f":"IFERROR(IF(VLOOKUP($A9,'Entry form'!$B$22:$R$103,2,0)=\"\",\"\",VLOOKUP($A9,'Entry form'!$B$22:$R$103,2,0)),\"\")","v":""},{"$f":"SUMIF('Entry form'!$C$22:$C$103,$B9,'Entry form'!$R$22:$R$103)","v":0},null,0]
[7,{"$f":"IFERROR(IF(VLOOKUP($A10,'Entry form'!$B$22:$R$103,2,0)=\"\",\"\",VLOOKUP($A10,'Entry form'!$B$22:$R$103,2,0)),\"\")","v":""},{"$f":"SUMIF('Entry form'!$C$22:$C$103,$B10,'Entry form'!$R$22:$R$103)","v":0},null,0]
[8,{"$f":"IFERROR(IF(VLOOKUP($A11,'Entry form'!$B$22:$R$103,2,0)=\"\",\"\",VLOOKUP($A11,'Entry form'!$B$22:$R$103,2,0)),\"\")","v":""},{"$f":"SUMIF('Entry form'!$C$22:$C$103,$B11,'Entry form'!$R$22:$R$103)","v":0},null,0]
[9,{"$f":"IFERROR(IF(VLOOKUP($A12,'Entry form'!$B$22:$R$103,2,0)=\"\",\"\",VLOOKUP($A12,'Entry form'!$B$22:$R$103,2,0)),\"\")","v":""},{"$f":"SUMIF('Entry form'!$C$22:$C$103,$B12,'Entry form'!$R$22:$R$103)","v":0},null,0]
[10,{"$f":"IFERROR(IF(VLOOKUP($A13,'Entry form'!$B$22:$R$103,2,0)=\"\",\"\",VLOOKUP($A13,'Entry form'!$B$22:$R$103,2,0)),\"\")","v":""},{"$f":"SUMIF('Entry form'!$C$22:$C$103,$B13,'Entry form'!$R$22:$R$103)","v":0},null,0]
[11,{"$f":"IFERROR(IF(VLOOKUP($A14,'Entry form'!$B$22:$R$103,2,0)=\"\",\"\",VLOOKUP($A14,'Entry form'!$B$22:$R$103,2,0)),\"\")","v":""},{"$f":"SUMIF('Entry form'!$C$22:$C$103,$B14,'Entry form'!$R$22:$R$103)","v":0},null,0]
[12,{"$f":"IFERROR(IF(VLOOKUP($A15,'Entry form'!$B$22:$R$103,2,0)=\"\",\"\",VLOOKUP($A15,'Entry form'!$B$22:$R$103,2,0)),\"\")","v":""},{"$f":"SUMIF('Entry form'!$C$22:$C$103,$B15,'Entry form'!$R$22:$R$103)","v":0},null,0]
{"$rows_left_out":152}
{"sheet":"INFO","index":3,"n_rows":55,"n_cols":18,"rows_kept":55,"cut":false,"hidden":true,"merged":[]}
["Team",null,"Divisions",null,"Weight info","Under","Over"]
["Children *","Kata  & Kumite","Belt & Age",null,"Children Girls",null,null,null,{"$f":"IF($F2=\"\",\"\",$E2&\" \"&F$1&\" \"&$F2&\" kg\")","v":""},{"$f":"IF(I2=\"\",\"\",IF(G2=\"\",$E2&\" \"&G$1&\" \"&$F2&\" kg\",$E2&\" \"&G$1&\" \"&$F2&\" \"&F$1&\" \"&G2&\" kg\"))","v":""},{"$f":"IF(I2=\"\",\"\",IF(G2=\"\",\"\",$E2&\" \"&G$1&\" \"&$G2&\" kg\"))","v":""}]
["Cadet *","Kata  & Kumite","Open *",null,"Children Boys",null,null,null,{"$f":"IF($F3=\"\",\"\",$E3&\" \"&F$1&\" \"&$F3&\" kg\")","v":""},{"$f":"IF(I3=\"\",\"\",IF(G3=\"\",$E3&\" \"&G$1&\" \"&$F3&\" kg\",$E3&\" \"&G$1&\" \"&$F3&\" \"&F$1&\" \"&G3&\" kg\"))","v":""},{"$f":"IF(I3=\"\",\"\",IF(G3=\"\",\"\",$E3&\" \"&G$1&\" \"&$G3&\" kg\"))","v":""}]
["Junior *","Kumite","Weight",null,"Cadet Female",50,null,null,"Cadet Female Under 50 kg","Cadet Female Over 50 kg",""]
["Senior *","Superkata","Superkata *",null,"Cadet Male",50,null,null,"Cadet Male Under 50 kg","Cadet Male Over 50 kg",""]
[null,null,null,null,"Junior Female",60,null,null,"Junior Female Under 60 kg","Junior Female Over 60 kg",""]
[null,null,null,null,"Junior Male",60,null,null,"Junior Male Under 60 kg","Junior Male Over 60 kg",""]
[null,null,null,null,"Senior Female",60,null,null,"Senior Female Under 60 kg","Senior Female Over 60 kg",""]
[null,null,null,null,"Senior Male",75,null,null,"Senior Male Under 75 kg","Senior Male Over 75 kg",""]
[]
[]
[]
[]
["Cadet *"]
["Junior *"]
{"$rows_left_out":41}
{"sheet":"Instructions","index":4,"n_rows":31,"n_cols":3,"rows_kept":31,"cut":false,"hidden":false,"merged":[[9,2,9,18],[26,2,26,18],[31,2,31,18],[27,2,27,18],[30,2,30,18],[28,2,28,18],[25,2,25,18],[11,2,11,18],[12,2,12,18],[10,2,10,18],[19,2,19,18],[18,2,18,18],[21,2,21,18],[20,2,20,18],[24,2,24,18],[13,2,13,18],[0,2,0,18],[1,2,1,18],[7,2,7,18],[6,2,6,18],[8,2,8,18],[4,2,4,18],[2,2,2,18],[3,2,3,18],[5,2,5,18],[14,2,14,18],[15,2,15,18],[22,2,22,18],[16,2,16,18],[17,2,17,18]]}
[null,null,"Instructions"]
[null,null,"Please complete the areas with your Dojo's information, contact details etc."]
[null,null,"White blocks require you to type in information; Orange blocks require you to make a selection from the drop down list supplied (little triangle); Blue blocks are information - no input from you required"]
[null,null,"Enter one line PER student PER division.   ( If the student will be competing in Kata & Kumite, that means 2 lines will be completed.)  IF the student is competing in the Team events, please enter it as his/her last event.  Please, if possible, enter all the events per particular students before starting with a next student.                     "]
[]
[null,null,"1.   NAME  & DOB (dd/mm/yy):     Type in the student's name and Date of Birth (day/month/year) please.  (These blocks are White) "]
[null,null,"2.   GENDER:     Select the gender of the student  (This block is Orange)"]
[null,null,"3.  AGE:              The system will automatically calculate the students age (date of competition)  (This block is Blue)"]
[null,null,"4.  BELT:             Select the Belt of the student  (This block is Orange)"]
[null,null,"5.  CLUB:            The Club information are automatically pulled through from the information that you've already entered (This block is Blue)"]
[null,null,"6.  CATEGORY: Select the category that the student will be competing in (in an Individual event or in a Team event) (This block is Orange)"]
[null,null,"7.  EVENT:          Select the Event that the student will be competing in (Kata, Kumite or Superkata).  Please note that Team events are split between Kata Team event and Kumite Team event.  (This block is Orange)"]
[null,null,"8.  DIVISION:    Select the Division that the student will be competing in, see 8.1 to 8.4 :   (This block is Orange). "]
[null,null,"8. 1  For Kata there is Opens (any belt or  age per group as per initiation) and Belt & Age (e.g. Blue belts age 8-9 boys);   "]
[null,null,"8.2.1  For Kumite there is Opens (ANY belt, WEIGHT or  age per group as per invitiation); "]
{"$rows_left_out":17}
{"sheet":"Tournament info","index":5,"n_rows":6,"n_cols":5,"rows_kept":6,"cut":false,"hidden":true,"merged":[]}
[]
["Cutt off date",null,"2015-11-01"]
[]
["Challenge name:",null,"LIONS",null,{"$f":"C4&\" Challenge\"","v":"LIONS Challenge"}]
[]
["Date of Tournament",null,"2015-08-15"]

{"sheet":"Sheet1","index":6,"n_rows":0,"n_cols":0,"rows_kept":0,"cut":false,"hidden":false,"merged":[]}

{"sheet":"Sheet2","index":7,"n_rows":0,"n_cols":0,"rows_kept":0,"cut":false,"hidden":false,"merged":[]}