{"text_format":"1","workbook":"xlsx","n_sheets":8,"sheets":["Entry form","Entry form Page 2","Fee","INFO","Instructions","Tournament info","Sheet1","Sheet2"],"not_rendered":{"charts":0,"images":1,"macros":1,"external_links":0,"defined_names":18,"comments":0,"pivot_tables":0},"unopened":[],"bounds":{"document_bytes":16777216,"sheet_cells":100000,"rows_first":2000,"rows_last":500,"rows_between":2000,"halvings":0,"cell_chars":16384,"cell_head_chars":4096},"cells_cut":0,"cells_raw":0,"read":"whole","date_system":"1900"}

{"sheet":"Entry form","index":0,"n_rows":111,"n_cols":22,"rows_kept":111,"cut":false,"hidden":false,"merged":[[10,3,10,5],[1,3,1,5],[2,3,2,5],[3,3,3,5],[4,3,4,5],[5,3,5,5],[6,3,6,5],[7,3,7,5],[8,2,9,2],[8,3,8,5],[9,3,9,5],[0,16,0,18],[0,10,0,13]]}
[null,null,"Karate League Entry Form",null,null,null,null,null,null,null,{"$f":"\"  \"&+'Tournament info'!E4","v":"  LIONS Challenge"},null,null,null,null,null,{"$f":"+'Tournament info'!C6","v":"2015-08-15"}]
[null,null,"Club:",null,null,null,null,null,"Are you WKF affiliated?",null,null,null,"Name",null,null,null,{"$f":"+'Tournament info'!C2","v":"2015-11-01"}]
[null,null,"Contact Person:",null,null,null,null,null,null,null,null,"Referees:"]
[null,null,"Tel No:",null,null,null,null,null,"YES"]
[null,null,"E-Mail:"]
[null,null,"Payment Details:",null,null,null,null,null,"NO"]
[null,null,"Team Manager:"]
[null,null,"Coaches:",null,null,null,null,null,null,null,null,"Table Officails:"]
[]
[]
[]
[null,null,null,null,"Total Entries:",{"$f":"COUNTA(C22:C103)+'Entry form Page 2'!F12","v":0},null,null,null,null,null,"Contestants:",{"$f":"MAX(B22:B103)+'Entry form Page 2'!M12","v":0}]
[null,null,null,null,"Payment Due:",{"$f":"SUM(R22:R104)+'Entry form Page 2'!F13","v":0},null,null,null,null,null,"Discount",{"$f":"IF(M12>40,15%,IF(M12>25,10%,IF(M12>15,5%,0%)))*F13","v":0},null,null,null,"Nett Payable:",null,{"$f":"+F13-M13","v":0}]
[]
[null,null,"Name","DOB (dd/mm/yy)","Gender","Age","Belt ",null,"Club","Category","Event","Division (* - For Points)","Weight Category","Category","Kata","Kumite","Fee category","Fee ","Team Name"]
[{"$f":"IF(C16=\"\",\"\",1)","v":1},{"$f":"IF(C16=\"\",\"\",1)","v":1},"Example A","1995-04-19","M",{"$f":"IF(D16=\"\",\"\",IF(MONTH($Q$1)>=MONTH(D16),IF(MONTH($Q$1)=MONTH(D16),IF(DAY($Q$1)>=DAY(D16),YEAR($Q$1)-YEAR(D16),YEAR($Q$1)-YEAR(D16)-1),YEAR($Q$1)-YEAR(D16)),YEAR($Q$1)-YEAR(D16)-1))","v":20},"Red",{"$f":"IF(F16=\"\",\"\",IF(F16<=13,\"Children\",IF(F16<=15,\"Cadet\",IF(F16<=17,\"Junior\",\"Senior\"))))","v":"Senior"},{"$f":"IF(C16=\"\",\"\",+$D$2)","v":0},"Individual","Kata","Open *",null,"Senior Opens",{"$f":"IF(K16=\"Kata\",\"X\",IF(K16=\"Team\",\"T\",\"\"))","v":"X"},{"$f":"IF(K16=\"Kumite\",\"X\",IF(K16=\"Team\",\"T\",\"\"))","v":""},{"$f":"IF(C16=\"\",\"\",IF(B16=B17,IF(B16=B19,\"\",IF(O17=\"T\",IF((COUNTIF($C$16:$C$21,C16)-COUNTIFS($C$16:$C$21,C16,$O$16:$O$21,\"T\"))>4,4,(COUNTIF($C$16:$C$21,C16)-COUNTIFS($C$16:$C$21,C16,$O$16:$O$21,\"T\"))),IF(O16=\"T\",\"Team\",\"\"))),1))","v":""},{"$f":"IF(Q16=\"\",\"\",IF(Q16=1,100,IF(Q16=2,180,IF(Q16=3,230,IF(Q16=\"Team\",70,250)))))","v":""},null,{"$f":"IF(L16=\"Open *\",IF(D16=\"\",\"\",IF(MONTH($Q$2)>=MONTH(D16),IF(MONTH($Q$2)=MONTH(D16),IF(DAY($Q$2)>=DAY(D16),YEAR($Q$2)-YEAR(D16),YEAR($Q$2)-YEAR(D16)-1),YEAR($Q$2)-YEAR(D16)),YEAR($Q$2)-YEAR(D16)-1)),\"\")","v":20},{"$f":"IF(T16=\"\",IF(L16=\"Belt & age\",IF(V16=\"\",IF(E16=\"m\",\"Boys \"&VLOOKUP(G16,INFO!B$19:C$27,2,0),\"Girls \"&VLOOKUP(G16,INFO!B$47:C$55,2,0)),V16),IF(L16=\"weight\",\"\",V16)),IF(J16=\"Team\",W16,IF(T16<14,\"Children\",IF(T16<16,\"Cadet\",IF(T16<18,\"Junior\",IF(T16<40,\"Senior\",\"Veterans\"))))&\" Opens\"))","v":"Senior Opens"},{"$f":"IF(F16>=14,IF(L16=\"Belt & Age\",IF(OR(G16=\"brown\",G16=\"black\"),\"NO SUCH DIVISION!!!\",\"Development\"),\"\"),\"\")","v":""}]
[{"$f":"IF(C17=\"\",\"\",A16+1)","v":2},{"$f":"IF(C17=\"\",\"\",IF(C17=C16,B16,B16+1))","v":1},"Example A","1995-04-19","M",20,"Red","Senior",{"$f":"IF(C17=\"\",\"\",+$D$2)","v":0},"Individual","Kumite","Open *",null,"Senior Opens",{"$f":"IF(J17=\"Individual\",IF(K17=\"Kata\",\"X\",IF(K17=\"Superkata\",\"S\",\"\")),IF(K17=\"kata\",\"T\",\"\"))","v":""},{"$f":"IF(J17=\"Individual\",IF(K17=\"Kumite\",\"X\",\"\"),IF(K17=\"kumite\",\"T\",\"\"))","v":"X"},{"$f":"IF(C17=\"\",\"\",IF(J17=\"Team\",\"Team\",IF(B17=B19,IF(J19=\"Team\",COUNTIF($C$16:$C$21,C17)-COUNTIFS($C$16:$C$21,C17,$J$16:$J$21,\"Team\"),\"\"),IF(J17=\"Team\",\"Team\",COUNTIF($C$16:$C$21,C17)-COUNTIFS($C$16:$C$21,C17,$J$16:$J$21,\"Team\")))))","v":""},{"$f":"IF(Q17=\"\",\"\",IF(Q17=1,100,IF(Q17=2,180,IF(Q17=3,230,IF(Q17=\"Team\",70,250)))))","v":""},null,20,{"$f":"IF(T17=\"\",IF(L17=\"Belt & age\",IF(V17=\"\",IF(E17=\"m\",\"Boys \"&VLOOKUP(G17,INFO!B$19:C$27,2,0),\"Girls \"&VLOOKUP(G17,INFO!B$47:C$55,2,0)),V17),IF(L17=\"weight\",\"\",V17)),IF(J17=\"Team\",W17,IF(T17<14,\"Children\",IF(T17<16,\"Cadet\",IF(T17<18,\"Junior\",IF(T17<40,\"Senior\",\"Veterans\"))))&\" Opens\"))","v":"Senior Opens"},{"$f":"IF(F17>=14,IF(L17=\"Belt & Age\",IF(OR(G17=\"brown\",G17=\"black\"),\"NO SUCH DIVISION!!!\",\"Development\"),\"\"),\"\")","v":""}]
[3,{"$f":"IF(C18=\"\",\"\",IF(C18=C16,B16,B16+1))","v":1},"Example A","1995-04-19","M",20,"Red",{"$f":"IF(F18=\"\",\"\",IF(F18<=13,\"Children\",IF(F18<=15,\"Cadet\",IF(F18<=17,\"Junior\",\"Senior\"))))","v":"Senior"},{"$f":"IF(C18=\"\",\"\",+$D$2)","v":0},"Individual","Kumite","Weight","Senior Male Under 75 kg","","","X",{"$f":"IF(C18=\"\",\"\",IF(J18=\"Team\",\"Team\",IF(B18=B19,IF(J19=\"Team\",COUNTIF($C$16:$C$21,C18)-COUNTIFS($C$16:$C$21,C18,$J$16:$J$21,\"Team\"),\"\"),IF(J18=\"Team\",\"Team\",COUNTIF($C$16:$C$21,C18)-COUNTIFS($C$16:$C$21,C18,$J$16:$J$21,\"Team\")))))","v":""},{"$f":"IF(Q18=\"\",\"\",IF(Q18=1,100,IF(Q18=2,180,IF(Q18=3,230,IF(Q18=\"Team\",70,250)))))","v":""},null,"",{"$f":"IF(T18=\"\",IF(L18=\"Belt & age\",IF(V18=\"\",IF(E18=\"m\",\"Boys \"&VLOOKUP(G18,INFO!B$19:C$27,2,0),\"Girls \"&VLOOKUP(G18,INFO!B$47:C$55,2,0)),V18),IF(L18=\"weight\",\"\",V18)),IF(J18=\"Team\",W18,IF(T18<14,\"Children\",IF(T18<16,\"Cadet\",IF(T18<18,\"Junior\",IF(T18<40,\"Senior\",\"Veterans\"))))&\" Opens\"))","v":""},{"$f":"IF(F18>=14,IF(L18=\"Belt & Age\",IF(OR(G18=\"brown\",G18=\"black\"),\"NO SUCH DIVISION!!!\",\"Development\"),\"\"),\"\")","v":""}]
[4,{"$f":"IF(C19=\"\",\"\",IF(C19=C17,B17,B17+1))","v":1},"Example A","1995-04-19","M",20,"Red","Senior",{"$f":"IF(C19=\"\",\"\",+$D$2)","v":0},"Individual","Kata","Belt & Age",null,"Development","X","",{"$f":"IF(C19=\"\",\"\",IF(J19=\"Team\",\"Team\",IF(B19=B20,IF(J20=\"Team\",COUNTIF($C$16:$C$21,C19)-COUNTIFS($C$16:$C$21,C19,$J$16:$J$21,\"Team\"),\"\"),IF(J19=\"Team\",\"Team\",COUNTIF($C$16:$C$21,C19)-COUNTIFS($C$16:$C$21,C19,$J$16:$J$21,\"Team\")))))","v":4},{"$f":"IF(Q19=\"\",\"\",IF(Q19=1,100,IF(Q19=2,180,IF(Q19=3,230,IF(Q19=\"Team\",70,250)))))","v":250},null,"",{"$f":"IF(T19=\"\",IF(L19=\"Belt & age\",IF(V19=\"\",IF(E19=\"m\",\"Boys \"&VLOOKUP(G19,INFO!B$19:C$27,2,0),\"Girls \"&VLOOKUP(G19,INFO!B$47:C$55,2,0)),V19),IF(L19=\"weight\",\"\",V19)),IF(J19=\"Team\",W19,IF(T19<14,\"Children\",IF(T19<16,\"Cadet\",IF(T19<18,\"Junior\",IF(T19<40,\"Senior\",\"Veterans\"))))&\" Opens\"))","v":"Development"},{"$f":"IF(F19>=14,IF(L19=\"Belt & Age\",IF(OR(G19=\"brown\",G19=\"black\"),\"NO SUCH DIVISION!!!\",\"Development\"),\"\"),\"\")","v":"Development"}]
[5,{"$f":"IF(C20=\"\",\"\",IF(C20=C19,B19,B19+1))","v":1},"Example A","1995-04-19","M",20,"Red",{"$f":"IF(F20=\"\",\"\",IF(F20<=13,\"Children\",IF(F20<=15,\"Cadet\",IF(F20<=17,\"Junior\",\"Senior\"))))","v":"Senior"},{"$f":"IF(C20=\"\",\"\",+$D$2)","v":0},"Team","Kata","Open *",null,"Senior *","T","",{"$f":"IF(C20=\"\",\"\",IF(J20=\"Team\",\"Team\",IF(B20=B21,IF(J21=\"Team\",COUNTIF($C$16:$C$21,C20)-COUNTIFS($C$16:$C$21,C20,$J$16:$J$21,\"Team\"),\"\"),IF(J20=\"Team\",\"Team\",COUNTIF($C$16:$C$21,C20)-COUNTIFS($C$16:$C$21,C20,$J$16:$J$21,\"Team\")))))","v":"Team"},{"$f":"IF(Q20=\"\",\"\",IF(Q20=1,100,IF(Q20=2,180,IF(Q20=3,230,IF(Q20=\"Team\",70,250)))))","v":70},"BEST A",20,{"$f":"IF(T20=\"\",IF(L20=\"Belt & age\",IF(V20=\"\",IF(E20=\"m\",\"Boys \"&VLOOKUP(G20,INFO!B$19:C$27,2,0),\"Girls \"&VLOOKUP(G20,INFO!B$47:C$55,2,0)),V20),IF(L20=\"weight\",\"\",V20)),IF(J20=\"Team\",W20,IF(T20<14,\"Children\",IF(T20<16,\"Cadet\",IF(T20<18,\"Junior\",IF(T20<40,\"Senior\",\"Veterans\"))))&\" Opens\"))","v":0},{"$f":"IF(F20>=14,IF(L20=\"Belt & Age\",IF(OR(G20=\"brown\",G20=\"black\"),\"NO SUCH DIVISION!!!\",\"Development\"),\"\"),\"\")","v":""}]
[{"$f":"IF(C21=\"\",\"\",A20+1)","v":6},{"$f":"IF(C21=\"\",\"\",IF(C21=C19,B19,B19+1))","v":1},"Example A","1995-04-19","M",20,"Red","Senior",{"$f":"IF(C21=\"\",\"\",+$D$2)","v":0},"Team","Kumite","Open *",null,"Senior *","","T",{"$f":"IF(C21=\"\",\"\",IF(J21=\"Team\",\"Team\",IF(B21=B22,IF(J22=\"Team\",COUNTIF($C$16:$C$21,C21)-COUNTIFS($C$16:$C$21,C21,$J$16:$J$21,\"Team\"),\"\"),IF(J21=\"Team\",\"Team\",COUNTIF($C$16:$C$21,C21)-COUNTIFS($C$16:$C$21,C21,$J$16:$J$21,\"Team\")))))","v":"Team"},70,"BEST B",20,{"$f":"IF(T21=\"\",IF(L21=\"Belt & age\",IF(V21=\"\",IF(E21=\"m\",\"Boys \"&VLOOKUP(G21,INFO!B$19:C$27,2,0),\"Girls \"&VLOOKUP(G21,INFO!B$47:C$55,2,0)),V21),IF(L21=\"weight\",\"\",V21)),IF(J21=\"Team\",W21,IF(T21<14,\"Children\",IF(T21<16,\"Cadet\",IF(T21<18,\"Junior\",IF(T21<40,\"Senior\",\"Veterans\"))))&\" Opens\"))","v":0},{"$f":"IF(F21>=14,IF(L21=\"Belt & Age\",IF(OR(G21=\"brown\",G21=\"black\"),\"NO SUCH DIVISION!!!\",\"Development\"),\"\"),\"\")","v":""}]
[{"$f":"IF(C22=\"\",\"\",1)","v":""},{"$f":"IF(C22=\"\",\"\",1)","v":""},null,null,null,"",null,{"$f":"IF(F22=\"\",\"\",IF(F22<=13,\"Children\",IF(F22<=15,\"Cadet\",IF(F22<=17,\"Junior\",\"Senior\"))))","v":""},{"$f":"IF(C22=\"\",\"\",+$D$2)","v":""},null,null,null,null,null,"","",{"$f":"IF(C22=\"\",\"\",IF(B22=B23,IF(B22=B24,\"\",IF(O23=\"T\",IF((COUNTIF($C$22:$C$66,C22)-COUNTIFS($C$22:$C$66,C22,$O$22:$O$66,\"T\"))>4,4,(COUNTIF($C$22:$C$66,C22)-COUNTIFS($C$22:$C$66,C22,$O$22:$O$66,\"T\"))),IF(O22=\"T\",\"Team\",\"\"))),1))","v":""},{"$f":"IF(Q22=\"\",\"\",IF(Q22=1,150,IF(Q22=2,250,IF(Q22=3,350,IF(Q22=\"team\",210/3,400)))))","v":""},null,"",{"$f":"IF(T22=\"\",IF(L22=\"Belt & age\",IF(V22=\"\",IF(E22=\"m\",\"Boys \"&VLOOKUP(G22,INFO!B$19:C$27,2,0),\"Girls \"&VLOOKUP(G22,INFO!B$47:C$55,2,0)),V22),IF(L22=\"weight\",\"\",V22)),IF(J22=\"Team\",W22,IF(T22<14,\"Children\",IF(T22<16,\"Cadet\",IF(T22<18,\"Junior\",IF(T22<21,\"Under 21\",IF(T22<40,\"Senior\",\"Veterans\"))))&\" Opens\")))","v":""},{"$f":"IF(F22>=14,IF(L22=\"Belt & Age\",IF(G22=\"black\",\"NO SUCH DIVISION!!!\",\"Development\"),\"\"),\"\")","v":""}]
[{"$f":"IF(C23=\"\",\"\",A22+1)","v":""},{"$f":"IF(C23=\"\",\"\",IF(C23=C22,B22,IF(MATCH(C23,C$22:C$103,0)>=(ROW()-51),MAX(B$22:B22)+1,INDIRECT(\"b\"&(MATCH(C23,C$22:C$103,0)+51),1))))","v":""},null,null,null,"",null,{"$f":"IF(F23=\"\",\"\",IF(F23<=13,\"Children\",IF(F23<=15,\"Cadet\",IF(F23<=17,\"Junior\",\"Senior\"))))","v":""},{"$f":"IF(C23=\"\",\"\",+$D$2)","v":""},null,null,null,null,null,"","",{"$f":"IF(C23=\"\",\"\",IF(J23=\"Team\",\"Team\",IF(COUNTIF($C$22:$C$103,C23)-COUNTIFS($C$22:$C$103,C23,$J$22:$J$103,\"Team\")>COUNTIF($C$22:$C23,C23)-COUNTIFS($C$22:$C23,C23,$J$22:$J23,\"Team\"),\"\",COUNTIF($C$22:$C$103,C23)-COUNTIFS($C$22:$C$103,C23,$J$22:$J$103,\"Team\"))))","v":""},"",null,"",{"$f":"IF(T23=\"\",IF(L23=\"Belt & age\",IF(V23=\"\",IF(E23=\"m\",\"Boys \"&VLOOKUP(G23,INFO!B$19:C$27,2,0),\"Girls \"&VLOOKUP(G23,INFO!B$47:C$55,2,0)),V23),IF(L23=\"weight\",\"\",V23)),IF(J23=\"Team\",W23,IF(T23<14,\"Children\",IF(T23<16,\"Cadet\",IF(T23<18,\"Junior\",IF(T23<21,\"Under 21\",IF(T23<40,\"Senior\",\"Veterans\"))))&\" Opens\")))","v":""},{"$f":"IF(F23>=14,IF(L23=\"Belt & Age\",IF(G23=\"black\",\"NO SUCH DIVISION!!!\",\"Development\"),\"\"),\"\")","v":""}]
["",{"$f":"IF(C24=\"\",\"\",IF(C24=C23,B23,IF(MATCH(C24,C$22:C$103,0)>=(ROW()-51),MAX(B$22:B23)+1,INDIRECT(\"b\"&(MATCH(C24,C$22:C$103,0)+51),1))))","v":""},null,null,null,"",null,{"$f":"IF(F24=\"\",\"\",IF(F24<=13,\"Children\",IF(F24<=15,\"Cadet\",IF(F24<=17,\"Junior\",\"Senior\"))))","v":""},{"$f":"IF(C24=\"\",\"\",+$D$2)","v":""},null,null,null,null,null,"","",{"$f":"IF(C24=\"\",\"\",IF(J24=\"Team\",\"Team\",IF(COUNTIF($C$22:$C$103,C24)-COUNTIFS($C$22:$C$103,C24,$J$22:$J$103,\"Team\")>COUNTIF($C$22:$C24,C24)-COUNTIFS($C$22:$C24,C24,$J$22:$J24,\"Team\"),\"\",COUNTIF($C$22:$C$103,C24)-COUNTIFS($C$22:$C$103,C24,$J$22:$J$103,\"Team\"))))","v":""},"",null,"",{"$f":"IF(T24=\"\",IF(L24=\"Belt & age\",IF(V24=\"\",IF(E24=\"m\",\"Boys \"&VLOOKUP(G24,INFO!B$19:C$27,2,0),\"Girls \"&VLOOKUP(G24,INFO!B$47:C$55,2,0)),V24),IF(L24=\"weight\",\"\",V24)),IF(J24=\"Team\",W24,IF(T24<14,\"Children\",IF(T24<16,\"Cadet\",IF(T24<18,\"Junior\",IF(T24<21,\"Under 21\",IF(T24<40,\"Senior\",\"Veterans\"))))&\" Opens\")))","v":""},{"$f":"IF(F24>=14,IF(L24=\"Belt & Age\",IF(G24=\"black\",\"NO SUCH DIVISION!!!\",\"Development\"),\"\"),\"\")","v":""}]
["",{"$f":"IF(C25=\"\",\"\",IF(C25=C24,B24,IF(MATCH(C25,C$22:C$103,0)>=(ROW()-51),MAX(B$22:B24)+1,INDIRECT(\"b\"&(MATCH(C25,C$22:C$103,0)+51),1))))","v":""},null,null,null,"",null,{"$f":"IF(F25=\"\",\"\",IF(F25<=13,\"Children\",IF(F25<=15,\"Cadet\",IF(F25<=17,\"Junior\",\"Senior\"))))","v":""},"",null,null,null,null,null,"","",{"$f":"IF(C25=\"\",\"\",IF(J25=\"Team\",\"Team\",IF(COUNTIF($C$22:$C$103,C25)-COUNTIFS($C$22:$C$103,C25,$J$22:$J$103,\"Team\")>COUNTIF($C$22:$C25,C25)-COUNTIFS($C$22:$C25,C25,$J$22:$J25,\"Team\"),\"\",COUNTIF($C$22:$C$103,C25)-COUNTIFS($C$22:$C$103,C25,$J$22:$J$103,\"Team\"))))","v":""},"",null,"",{"$f":"IF(T25=\"\",IF(L25=\"Belt & age\",IF(V25=\"\",IF(E25=\"m\",\"Boys \"&VLOOKUP(G25,INFO!B$19:C$27,2,0),\"Girls \"&VLOOKUP(G25,INFO!B$47:C$55,2,0)),V25),IF(L25=\"weight\",\"\",V25)),IF(J25=\"Team\",W25,IF(T25<14,\"Children\",IF(T25<16,\"Cadet\",IF(T25<18,\"Junior\",IF(T25<21,\"Under 21\",IF(T25<40,\"Senior\",\"Veterans\"))))&\" Opens\")))","v":""},{"$f":"IF(F25>=14,IF(L25=\"Belt & Age\",IF(G25=\"black\",\"NO SUCH DIVISION!!!\",\"Development\"),\"\"),\"\")","v":""}]
["",{"$f":"IF(C26=\"\",\"\",IF(C26=C25,B25,IF(MATCH(C26,C$22:C$103,0)>=(ROW()-51),MAX(B$22:B25)+1,INDIRECT(\"b\"&(MATCH(C26,C$22:C$103,0)+51),1))))","v":""},null,null,null,"",null,{"$f":"IF(F26=\"\",\"\",IF(F26<=13,\"Children\",IF(F26<=15,\"Cadet\",IF(F26<=17,\"Junior\",\"Senior\"))))","v":""},"",null,null,null,null,null,"","",{"$f":"IF(C26=\"\",\"\",IF(J26=\"Team\",\"Team\",IF(COUNTIF($C$22:$C$103,C26)-COUNTIFS($C$22:$C$103,C26,$J$22:$J$103,\"Team\")>COUNTIF($C$22:$C26,C26)-COUNTIFS($C$22:$C26,C26,$J$22:$J26,\"Team\"),\"\",COUNTIF($C$22:$C$103,C26)-COUNTIFS($C$22:$C$103,C26,$J$22:$J$103,\"Team\"))))","v":""},"",null,"",{"$f":"IF(T26=\"\",IF(L26=\"Belt & age\",IF(V26=\"\",IF(E26=\"m\",\"Boys \"&VLOOKUP(G26,INFO!B$19:C$27,2,0),\"Girls \"&VLOOKUP(G26,INFO!B$47:C$55,2,0)),V26),IF(L26=\"weight\",\"\",V26)),IF(J26=\"Team\",W26,IF(T26<14,\"Children\",IF(T26<16,\"Cadet\",IF(T26<18,\"Junior\",IF(T26<21,\"Under 21\",IF(T26<40,\"Senior\",\"Veterans\"))))&\" Opens\")))","v":""},{"$f":"IF(F26>=14,IF(L26=\"Belt & Age\",IF(G26=\"black\",\"NO SUCH DIVISION!!!\",\"Development\"),\"\"),\"\")","v":""}]
["",{"$f":"IF(C27=\"\",\"\",IF(C27=C26,B26,IF(MATCH(C27,C$22:C$103,0)>=(ROW()-51),MAX(B$22:B26)+1,INDIRECT(\"b\"&(MATCH(C27,C$22:C$103,0)+51),1))))","v":""},null,null,null,"",null,{"$f":"IF(F27=\"\",\"\",IF(F27<=13,\"Children\",IF(F27<=15,\"Cadet\",IF(F27<=17,\"Junior\",\"Senior\"))))","v":""},"",null,null,null,null,null,"","",{"$f":"IF(C27=\"\",\"\",IF(J27=\"Team\",\"Team\",IF(COUNTIF($C$22:$C$103,C27)-COUNTIFS($C$22:$C$103,C27,$J$22:$J$103,\"Team\")>COUNTIF($C$22:$C27,C27)-COUNTIFS($C$22:$C27,C27,$J$22:$J27,\"Team\"),\"\",COUNTIF($C$22:$C$103,C27)-COUNTIFS($C$22:$C$103,C27,$J$22:$J$103,\"Team\"))))","v":""},"",null,"",{"$f":"IF(T27=\"\",IF(L27=\"Belt & age\",IF(V27=\"\",IF(E27=\"m\",\"Boys \"&VLOOKUP(G27,INFO!B$19:C$27,2,0),\"Girls \"&VLOOKUP(G27,INFO!B$47:C$55,2,0)),V27),IF(L27=\"weight\",\"\",V27)),IF(J27=\"Team\",W27,IF(T27<14,\"Children\",IF(T27<16,\"Cadet\",IF(T27<18,\"Junior\",IF(T27<21,\"Under 21\",IF(T27<40,\"Senior\",\"Veterans\"))))&\" Opens\")))","v":""},{"$f":"IF(F27>=14,IF(L27=\"Belt & Age\",IF(G27=\"black\",\"NO SUCH DIVISION!!!\",\"Development\"),\"\"),\"\")","v":""}]
["",{"$f":"IF(C28=\"\",\"\",IF(C28=C27,B27,IF(MATCH(C28,C$22:C$103,0)>=(ROW()-51),MAX(B$22:B27)+1,INDIRECT(\"b\"&(MATCH(C28,C$22:C$103,0)+51),1))))","v":""},null,null,null,"",null,{"$f":"IF(F28=\"\",\"\",IF(F28<=13,\"Children\",IF(F28<=15,\"Cadet\",IF(F28<=17,\"Junior\",\"Senior\"))))","v":""},"",null,null,null,null,null,"","",{"$f":"IF(C28=\"\",\"\",IF(J28=\"Team\",\"Team\",IF(COUNTIF($C$22:$C$103,C28)-COUNTIFS($C$22:$C$103,C28,$J$22:$J$103,\"Team\")>COUNTIF($C$22:$C28,C28)-COUNTIFS($C$22:$C28,C28,$J$22:$J28,\"Team\"),\"\",COUNTIF($C$22:$C$103,C28)-COUNTIFS($C$22:$C$103,C28,$J$22:$J$103,\"Team\"))))","v":""},"",null,"",{"$f":"IF(T28=\"\",IF(L28=\"Belt & age\",IF(V28=\"\",IF(E28=\"m\",\"Boys \"&VLOOKUP(G28,INFO!B$19:C$27,2,0),\"Girls \"&VLOOKUP(G28,INFO!B$47:C$55,2,0)),V28),IF(L28=\"weight\",\"\",V28)),IF(J28=\"Team\",W28,IF(T28<14,\"Children\",IF(T28<16,\"Cadet\",IF(T28<18,\"Junior\",IF(T28<21,\"Under 21\",IF(T28<40,\"Senior\",\"Veterans\"))))&\" Opens\")))","v":""},{"$f":"IF(F28>=14,IF(L28=\"Belt & Age\",IF(G28=\"black\",\"NO SUCH DIVISION!!!\",\"Development\"),\"\"),\"\")","v":""}]
["",{"$f":"IF(C29=\"\",\"\",IF(C29=C28,B28,IF(MATCH(C29,C$22:C$103,0)>=(ROW()-51),MAX(B$22:B28)+1,INDIRECT(\"b\"&(MATCH(C29,C$22:C$103,0)+51),1))))","v":""},null,null,null,"",null,{"$f":"IF(F29=\"\",\"\",IF(F29<=13,\"Children\",IF(F29<=15,\"Cadet\",IF(F29<=17,\"Junior\",\"Senior\"))))","v":""},"",null,null,null,null,null,"","",{"$f":"IF(C29=\"\",\"\",IF(J29=\"Team\",\"Team\",IF(COUNTIF($C$22:$C$103,C29)-COUNTIFS($C$22:$C$103,C29,$J$22:$J$103,\"Team\")>COUNTIF($C$22:$C29,C29)-COUNTIFS($C$22:$C29,C29,$J$22:$J29,\"Team\"),\"\",COUNTIF($C$22:$C$103,C29)-COUNTIFS($C$22:$C$103,C29,$J$22:$J$103,\"Team\"))))","v":""},"",null,"",{"$f":"IF(T29=\"\",IF(L29=\"Belt & age\",IF(V29=\"\",IF(E29=\"m\",\"Boys \"&VLOOKUP(G29,INFO!B$19:C$27,2,0),\"Girls \"&VLOOKUP(G29,INFO!B$47:C$55,2,0)),V29),IF(L29=\"weight\",\"\",V29)),IF(J29=\"Team\",W29,IF(T29<14,\"Children\",IF(T29<16,\"Cadet\",IF(T29<18,\"Junior\",IF(T29<21,\"Under 21\",IF(T29<40,\"Senior\",\"Veterans\"))))&\" Opens\")))","v":""},{"$f":"IF(F29>=14,IF(L29=\"Belt & Age\",IF(G29=\"black\",\"NO SUCH DIVISION!!!\",\"Development\"),\"\"),\"\")","v":""}]
["",{"$f":"IF(C30=\"\",\"\",IF(C30=C29,B29,IF(MATCH(C30,C$22:C$103,0)>=(ROW()-51),MAX(B$22:B29)+1,INDIRECT(\"b\"&(MATCH(C30,C$22:C$103,0)+51),1))))","v":""},null,null,null,"",null,{"$f":"IF(F30=\"\",\"\",IF(F30<=13,\"Children\",IF(F30<=15,\"Cadet\",IF(F30<=17,\"Junior\",\"Senior\"))))","v":""},"",null,null,null,null,null,"","",{"$f":"IF(C30=\"\",\"\",IF(J30=\"Team\",\"Team\",IF(COUNTIF($C$22:$C$103,C30)-COUNTIFS($C$22:$C$103,C30,$J$22:$J$103,\"Team\")>COUNTIF($C$22:$C30,C30)-COUNTIFS($C$22:$C30,C30,$J$22:$J30,\"Team\"),\"\",COUNTIF($C$22:$C$103,C30)-COUNTIFS($C$22:$C$103,C30,$J$22:$J$103,\"Team\"))))","v":""},"",null,"",{"$f":"IF(T30=\"\",IF(L30=\"Belt & age\",IF(V30=\"\",IF(E30=\"m\",\"Boys \"&VLOOKUP(G30,INFO!B$19:C$27,2,0),\"Girls \"&VLOOKUP(G30,INFO!B$47:C$55,2,0)),V30),IF(L30=\"weight\",\"\",V30)),IF(J30=\"Team\",W30,IF(T30<14,\"Children\",IF(T30<16,\"Cadet\",IF(T30<18,\"Junior\",IF(T30<21,\"Under 21\",IF(T30<40,\"Senior\",\"Veterans\"))))&\" Opens\")))","v":""},{"$f":"IF(F30>=14,IF(L30=\"Belt & Age\",IF(G30=\"black\",\"NO SUCH DIVISION!!!\",\"Development\"),\"\"),\"\")","v":""}]
["",{"$f":"IF(C31=\"\",\"\",IF(C31=C30,B30,IF(MATCH(C31,C$22:C$103,0)>=(ROW()-51),MAX(B$22:B30)+1,INDIRECT(\"b\"&(MATCH(C31,C$22:C$103,0)+51),1))))","v":""},null,null,null,"",null,{"$f":"IF(F31=\"\",\"\",IF(F31<=13,\"Children\",IF(F31<=15,\"Cadet\",IF(F31<=17,\"Junior\",\"Senior\"))))","v":""},"",null,null,null,null,null,"","",{"$f":"IF(C31=\"\",\"\",IF(J31=\"Team\",\"Team\",IF(COUNTIF($C$22:$C$103,C31)-COUNTIFS($C$22:$C$103,C31,$J$22:$J$103,\"Team\")>COUNTIF($C$22:$C31,C31)-COUNTIFS($C$22:$C31,C31,$J$22:$J31,\"Team\"),\"\",COUNTIF($C$22:$C$103,C31)-COUNTIFS($C$22:$C$103,C31,$J$22:$J$103,\"Team\"))))","v":""},"",null,"",{"$f":"IF(T31=\"\",IF(L31=\"Belt & age\",IF(V31=\"\",IF(E31=\"m\",\"Boys \"&VLOOKUP(G31,INFO!B$19:C$27,2,0),\"Girls \"&VLOOKUP(G31,INFO!B$47:C$55,2,0)),V31),IF(L31=\"weight\",\"\",V31)),IF(J31=\"Team\",W31,IF(T31<14,\"Children\",IF(T31<16,\"Cadet\",IF(T31<18,\"Junior\",IF(T31<21,\"Under 21\",IF(T31<40,\"Senior\",\"Veterans\"))))&\" Opens\")))","v":""},{"$f":"IF(F31>=14,IF(L31=\"Belt & Age\",IF(G31=\"black\",\"NO SUCH DIVISION!!!\",\"Development\"),\"\"),\"\")","v":""}]
[{"$f":"IF(C32=\"\",\"\",A31+1)","v":""},{"$f":"IF(C32=\"\",\"\",IF(C32=C31,B31,IF(MATCH(C32,C$22:C$103,0)>=(ROW()-51),MAX(B$22:B31)+1,INDIRECT(\"b\"&(MATCH(C32,C$22:C$103,0)+51),1))))","v":""},null,null,null,"",null,{"$f":"IF(F32=\"\",\"\",IF(F32<=13,\"Children\",IF(F32<=15,\"Cadet\",IF(F32<=17,\"Junior\",\"Senior\"))))","v":""},"",null,null,null,null,null,"","",{"$f":"IF(C32=\"\",\"\",IF(J32=\"Team\",\"Team\",IF(COUNTIF($C$22:$C$103,C32)-COUNTIFS($C$22:$C$103,C32,$J$22:$J$103,\"Team\")>COUNTIF($C$22:$C32,C32)-COUNTIFS($C$22:$C32,C32,$J$22:$J32,\"Team\"),\"\",COUNTIF($C$22:$C$103,C32)-COUNTIFS($C$22:$C$103,C32,$J$22:$J$103,\"Team\"))))","v":""},"",null,"",{"$f":"IF(T32=\"\",IF(L32=\"Belt & age\",IF(V32=\"\",IF(E32=\"m\",\"Boys \"&VLOOKUP(G32,INFO!B$19:C$27,2,0),\"Girls \"&VLOOKUP(G32,INFO!B$47:C$55,2,0)),V32),IF(L32=\"weight\",\"\",V32)),IF(J32=\"Team\",W32,IF(T32<14,\"Children\",IF(T32<16,\"Cadet\",IF(T32<18,\"Junior\",IF(T32<21,\"Under 21\",IF(T32<40,\"Senior\",\"Veterans\"))))&\" Opens\")))","v":""},{"$f":"IF(F32>=14,IF(L32=\"Belt & Age\",IF(G32=\"black\",\"NO SUCH DIVISION!!!\",\"Development\"),\"\"),\"\")","v":""}]
["",{"$f":"IF(C33=\"\",\"\",IF(C33=C32,B32,IF(MATCH(C33,C$22:C$103,0)>=(ROW()-51),MAX(B$22:B32)+1,INDIRECT(\"b\"&(MATCH(C33,C$22:C$103,0)+51),1))))","v":""},null,null,null,"",null,{"$f":"IF(F33=\"\",\"\",IF(F33<=13,\"Children\",IF(F33<=15,\"Cadet\",IF(F33<=17,\"Junior\",\"Senior\"))))","v":""},"",null,null,null,null,null,"","",{"$f":"IF(C33=\"\",\"\",IF(J33=\"Team\",\"Team\",IF(COUNTIF($C$22:$C$103,C33)-COUNTIFS($C$22:$C$103,C33,$J$22:$J$103,\"Team\")>COUNTIF($C$22:$C33,C33)-COUNTIFS($C$22:$C33,C33,$J$22:$J33,\"Team\"),\"\",COUNTIF($C$22:$C$103,C33)-COUNTIFS($C$22:$C$103,C33,$J$22:$J$103,\"Team\"))))","v":""},"",null,"",{"$f":"IF(T33=\"\",IF(L33=\"Belt & age\",IF(V33=\"\",IF(E33=\"m\",\"Boys \"&VLOOKUP(G33,INFO!B$19:C$27,2,0),\"Girls \"&VLOOKUP(G33,INFO!B$47:C$55,2,0)),V33),IF(L33=\"weight\",\"\",V33)),IF(J33=\"Team\",W33,IF(T33<14,\"Children\",IF(T33<16,\"Cadet\",IF(T33<18,\"Junior\",IF(T33<21,\"Under 21\",IF(T33<40,\"Senior\",\"Veterans\"))))&\" Opens\")))","v":""},{"$f":"IF(F33>=14,IF(L33=\"Belt & Age\",IF(G33=\"black\",\"NO SUCH DIVISION!!!\",\"Development\"),\"\"),\"\")","v":""}]
["",{"$f":"IF(C34=\"\",\"\",IF(C34=C33,B33,IF(MATCH(C34,C$22:C$103,0)>=(ROW()-51),MAX(B$22:B33)+1,INDIRECT(\"b\"&(MATCH(C34,C$22:C$103,0)+51),1))))","v":""},null,null,null,"",null,{"$f":"IF(F34=\"\",\"\",IF(F34<=13,\"Children\",IF(F34<=15,\"Cadet\",IF(F34<=17,\"Junior\",\"Senior\"))))","v":""},"",null,null,null,null,null,"","",{"$f":"IF(C34=\"\",\"\",IF(J34=\"Team\",\"Team\",IF(COUNTIF($C$22:$C$103,C34)-COUNTIFS($C$22:$C$103,C34,$J$22:$J$103,\"Team\")>COUNTIF($C$22:$C34,C34)-COUNTIFS($C$22:$C34,C34,$J$22:$J34,\"Team\"),\"\",COUNTIF($C$22:$C$103,C34)-COUNTIFS($C$22:$C$103,C34,$J$22:$J$103,\"Team\"))))","v":""},"",null,"",{"$f":"IF(T34=\"\",IF(L34=\"Belt & age\",IF(V34=\"\",IF(E34=\"m\",\"Boys \"&VLOOKUP(G34,INFO!B$19:C$27,2,0),\"Girls \"&VLOOKUP(G34,INFO!B$47:C$55,2,0)),V34),IF(L34=\"weight\",\"\",V34)),IF(J34=\"Team\",W34,IF(T34<14,\"Children\",IF(T34<16,\"Cadet\",IF(T34<18,\"Junior\",IF(T34<21,\"Under 21\",IF(T34<40,\"Senior\",\"Veterans\"))))&\" Opens\")))","v":""},{"$f":"IF(F34>=14,IF(L34=\"Belt & Age\",IF(G34=\"black\",\"NO SUCH DIVISION!!!\",\"Development\"),\"\"),\"\")","v":""}]
["",{"$f":"IF(C35=\"\",\"\",IF(C35=C34,B34,IF(MATCH(C35,C$22:C$103,0)>=(ROW()-51),MAX(B$22:B34)+1,INDIRECT(\"b\"&(MATCH(C35,C$22:C$103,0)+51),1))))","v":""},null,null,null,"",null,{"$f":"IF(F35=\"\",\"\",IF(F35<=13,\"Children\",IF(F35<=15,\"Cadet\",IF(F35<=17,\"Junior\",\"Senior\"))))","v":""},"",null,null,null,null,null,"","",{"$f":"IF(C35=\"\",\"\",IF(J35=\"Team\",\"Team\",IF(COUNTIF($C$22:$C$103,C35)-COUNTIFS($C$22:$C$103,C35,$J$22:$J$103,\"Team\")>COUNTIF($C$22:$C35,C35)-COUNTIFS($C$22:$C35,C35,$J$22:$J35,\"Team\"),\"\",COUNTIF($C$22:$C$103,C35)-COUNTIFS($C$22:$C$103,C35,$J$22:$J$103,\"Team\"))))","v":""},"",null,"",{"$f":"IF(T35=\"\",IF(L35=\"Belt & age\",IF(V35=\"\",IF(E35=\"m\",\"Boys \"&VLOOKUP(G35,INFO!B$19:C$27,2,0),\"Girls \"&VLOOKUP(G35,INFO!B$47:C$55,2,0)),V35),IF(L35=\"weight\",\"\",V35)),IF(J35=\"Team\",W35,IF(T35<14,\"Children\",IF(T35<16,\"Cadet\",IF(T35<18,\"Junior\",IF(T35<21,\"Under 21\",IF(T35<40,\"Senior\",\"Veterans\"))))&\" Opens\")))","v":""},{"$f":"IF(F35>=14,IF(L35=\"Belt & Age\",IF(G35=\"black\",\"NO SUCH DIVISION!!!\",\"Development\"),\"\"),\"\")","v":""}]
["",{"$f":"IF(C36=\"\",\"\",IF(C36=C35,B35,IF(MATCH(C36,C$22:C$103,0)>=(ROW()-51),MAX(B$22:B35)+1,INDIRECT(\"b\"&(MATCH(C36,C$22:C$103,0)+51),1))))","v":""},null,null,null,"",null,{"$f":"IF(F36=\"\",\"\",IF(F36<=13,\"Children\",IF(F36<=15,\"Cadet\",IF(F36<=17,\"Junior\",\"Senior\"))))","v":""},"",null,null,null,null,null,"","",{"$f":"IF(C36=\"\",\"\",IF(J36=\"Team\",\"Team\",IF(COUNTIF($C$22:$C$103,C36)-COUNTIFS($C$22:$C$103,C36,$J$22:$J$103,\"Team\")>COUNTIF($C$22:$C36,C36)-COUNTIFS($C$22:$C36,C36,$J$22:$J36,\"Team\"),\"\",COUNTIF($C$22:$C$103,C36)-COUNTIFS($C$22:$C$103,C36,$J$22:$J$103,\"Team\"))))","v":""},"",null,"",{"$f":"IF(T36=\"\",IF(L36=\"Belt & age\",IF(V36=\"\",IF(E36=\"m\",\"Boys \"&VLOOKUP(G36,INFO!B$19:C$27,2,0),\"Girls \"&VLOOKUP(G36,INFO!B$47:C$55,2,0)),V36),IF(L36=\"weight\",\"\",V36)),IF(J36=\"Team\",W36,IF(T36<14,\"Children\",IF(T36<16,\"Cadet\",IF(T36<18,\"Junior\",IF(T36<21,\"Under 21\",IF(T36<40,\"Senior\",\"Veterans\"))))&\" Opens\")))","v":""},{"$f":"IF(F36>=14,IF(L36=\"Belt & Age\",IF(G36=\"black\",\"NO SUCH DIVISION!!!\",\"Development\"),\"\"),\"\")","v":""}]
["",{"$f":"IF(C37=\"\",\"\",IF(C37=C36,B36,IF(MATCH(C37,C$22:C$103,0)>=(ROW()-51),MAX(B$22:B36)+1,INDIRECT(\"b\"&(MATCH(C37,C$22:C$103,0)+51),1))))","v":""},null,null,null,"",null,{"$f":"IF(F37=\"\",\"\",IF(F37<=13,\"Children\",IF(F37<=15,\"Cadet\",IF(F37<=17,\"Junior\",\"Senior\"))))","v":""},"",null,null,null,null,null,"","",{"$f":"IF(C37=\"\",\"\",IF(J37=\"Team\",\"Team\",IF(COUNTIF($C$22:$C$103,C37)-COUNTIFS($C$22:$C$103,C37,$J$22:$J$103,\"Team\")>COUNTIF($C$22:$C37,C37)-COUNTIFS($C$22:$C37,C37,$J$22:$J37,\"Team\"),\"\",COUNTIF($C$22:$C$103,C37)-COUNTIFS($C$22:$C$103,C37,$J$22:$J$103,\"Team\"))))","v":""},"",null,"",{"$f":"IF(T37=\"\",IF(L37=\"Belt & age\",IF(V37=\"\",IF(E37=\"m\",\"Boys \"&VLOOKUP(G37,INFO!B$19:C$27,2,0),\"Girls \"&VLOOKUP(G37,INFO!B$47:C$55,2,0)),V37),IF(L37=\"weight\",\"\",V37)),IF(J37=\"Team\",W37,IF(T37<14,\"Children\",IF(T37<16,\"Cadet\",IF(T37<18,\"Junior\",IF(T37<21,\"Under 21\",IF(T37<40,\"Senior\",\"Veterans\"))))&\" Opens\")))","v":""},{"$f":"IF(F37>=14,IF(L37=\"Belt & Age\",IF(G37=\"black\",\"NO SUCH DIVISION!!!\",\"Development\"),\"\"),\"\")","v":""}]
["",{"$f":"IF(C38=\"\",\"\",IF(C38=C37,B37,IF(MATCH(C38,C$22:C$103,0)>=(ROW()-51),MAX(B$22:B37)+1,INDIRECT(\"b\"&(MATCH(C38,C$22:C$103,0)+51),1))))","v":""},null,null,null,"",null,{"$f":"IF(F38=\"\",\"\",IF(F38<=13,\"Children\",IF(F38<=15,\"Cadet\",IF(F38<=17,\"Junior\",\"Senior\"))))","v":""},"",null,null,null,null,null,"","",{"$f":"IF(C38=\"\",\"\",IF(J38=\"Team\",\"Team\",IF(COUNTIF($C$22:$C$103,C38)-COUNTIFS($C$22:$C$103,C38,$J$22:$J$103,\"Team\")>COUNTIF($C$22:$C38,C38)-COUNTIFS($C$22:$C38,C38,$J$22:$J38,\"Team\"),\"\",COUNTIF($C$22:$C$103,C38)-COUNTIFS($C$22:$C$103,C38,$J$22:$J$103,\"Team\"))))","v":""},"",null,"",{"$f":"IF(T38=\"\",IF(L38=\"Belt & age\",IF(V38=\"\",IF(E38=\"m\",\"Boys \"&VLOOKUP(G38,INFO!B$19:C$27,2,0),\"Girls \"&VLOOKUP(G38,INFO!B$47:C$55,2,0)),V38),IF(L38=\"weight\",\"\",V38)),IF(J38=\"Team\",W38,IF(T38<14,\"Children\",IF(T38<16,\"Cadet\",IF(T38<18,\"Junior\",IF(T38<21,\"Under 21\",IF(T38<40,\"Senior\",\"Veterans\"))))&\" Opens\")))","v":""},{"$f":"IF(F38>=14,IF(L38=\"Belt & Age\",IF(G38=\"black\",\"NO SUCH DIVISION!!!\",\"Development\"),\"\"),\"\")","v":""}]
["",{"$f":"IF(C39=\"\",\"\",IF(C39=C38,B38,IF(MATCH(C39,C$22:C$103,0)>=(ROW()-51),MAX(B$22:B38)+1,INDIRECT(\"b\"&(MATCH(C39,C$22:C$103,0)+51),1))))","v":""},null,null,null,"",null,{"$f":"IF(F39=\"\",\"\",IF(F39<=13,\"Children\",IF(F39<=15,\"Cadet\",IF(F39<=17,\"Junior\",\"Senior\"))))","v":""},"",null,null,null,null,null,"","",{"$f":"IF(C39=\"\",\"\",IF(J39=\"Team\",\"Team\",IF(COUNTIF($C$22:$C$103,C39)-COUNTIFS($C$22:$C$103,C39,$J$22:$J$103,\"Team\")>COUNTIF($C$22:$C39,C39)-COUNTIFS($C$22:$C39,C39,$J$22:$J39,\"Team\"),\"\",COUNTIF($C$22:$C$103,C39)-COUNTIFS($C$22:$C$103,C39,$J$22:$J$103,\"Team\"))))","v":""},"",null,"",{"$f":"IF(T39=\"\",IF(L39=\"Belt & age\",IF(V39=\"\",IF(E39=\"m\",\"Boys \"&VLOOKUP(G39,INFO!B$19:C$27,2,0),\"Girls \"&VLOOKUP(G39,INFO!B$47:C$55,2,0)),V39),IF(L39=\"weight\",\"\",V39)),IF(J39=\"Team\",W39,IF(T39<14,\"Children\",IF(T39<16,\"Cadet\",IF(T39<18,\"Junior\",IF(T39<21,\"Under 21\",IF(T39<40,\"Senior\",\"Veterans\"))))&\" Opens\")))","v":""},{"$f":"IF(F39>=14,IF(L39=\"Belt & Age\",IF(G39=\"black\",\"NO SUCH DIVISION!!!\",\"Development\"),\"\"),\"\")","v":""}]
["",{"$f":"IF(C40=\"\",\"\",IF(C40=C39,B39,IF(MATCH(C40,C$22:C$103,0)>=(ROW()-51),MAX(B$22:B39)+1,INDIRECT(\"b\"&(MATCH(C40,C$22:C$103,0)+51),1))))","v":""},null,null,null,"",null,{"$f":"IF(F40=\"\",\"\",IF(F40<=13,\"Children\",IF(F40<=15,\"Cadet\",IF(F40<=17,\"Junior\",\"Senior\"))))","v":""},"",null,null,null,null,null,"","",{"$f":"IF(C40=\"\",\"\",IF(J40=\"Team\",\"Team\",IF(COUNTIF($C$22:$C$103,C40)-COUNTIFS($C$22:$C$103,C40,$J$22:$J$103,\"Team\")>COUNTIF($C$22:$C40,C40)-COUNTIFS($C$22:$C40,C40,$J$22:$J40,\"Team\"),\"\",COUNTIF($C$22:$C$103,C40)-COUNTIFS($C$22:$C$103,C40,$J$22:$J$103,\"Team\"))))","v":""},"",null,"",{"$f":"IF(T40=\"\",IF(L40=\"Belt & age\",IF(V40=\"\",IF(E40=\"m\",\"Boys \"&VLOOKUP(G40,INFO!B$19:C$27,2,0),\"Girls \"&VLOOKUP(G40,INFO!B$47:C$55,2,0)),V40),IF(L40=\"weight\",\"\",V40)),IF(J40=\"Team\",W40,IF(T40<14,\"Children\",IF(T40<16,\"Cadet\",IF(T40<18,\"Junior\",IF(T40<21,\"Under 21\",IF(T40<40,\"Senior\",\"Veterans\"))))&\" Opens\")))","v":""},{"$f":"IF(F40>=14,IF(L40=\"Belt & Age\",IF(G40=\"black\",\"NO SUCH DIVISION!!!\",\"Development\"),\"\"),\"\")","v":""}]
["",{"$f":"IF(C41=\"\",\"\",IF(C41=C40,B40,IF(MATCH(C41,C$22:C$103,0)>=(ROW()-51),MAX(B$22:B40)+1,INDIRECT(\"b\"&(MATCH(C41,C$22:C$103,0)+51),1))))","v":""},null,null,null,"",null,{"$f":"IF(F41=\"\",\"\",IF(F41<=13,\"Children\",IF(F41<=15,\"Cadet\",IF(F41<=17,\"Junior\",\"Senior\"))))","v":""},"",null,null,null,null,null,"","",{"$f":"IF(C41=\"\",\"\",IF(J41=\"Team\",\"Team\",IF(COUNTIF($C$22:$C$103,C41)-COUNTIFS($C$22:$C$103,C41,$J$22:$J$103,\"Team\")>COUNTIF($C$22:$C41,C41)-COUNTIFS($C$22:$C41,C41,$J$22:$J41,\"Team\"),\"\",COUNTIF($C$22:$C$103,C41)-COUNTIFS($C$22:$C$103,C41,$J$22:$J$103,\"Team\"))))","v":""},"",null,"",{"$f":"IF(T41=\"\",IF(L41=\"Belt & age\",IF(V41=\"\",IF(E41=\"m\",\"Boys \"&VLOOKUP(G41,INFO!B$19:C$27,2,0),\"Girls \"&VLOOKUP(G41,INFO!B$47:C$55,2,0)),V41),IF(L41=\"weight\",\"\",V41)),IF(J41=\"Team\",W41,IF(T41<14,\"Children\",IF(T41<16,\"Cadet\",IF(T41<18,\"Junior\",IF(T41<21,\"Under 21\",IF(T41<40,\"Senior\",\"Veterans\"))))&\" Opens\")))","v":""},{"$f":"IF(F41>=14,IF(L41=\"Belt & Age\",IF(G41=\"black\",\"NO SUCH DIVISION!!!\",\"Development\"),\"\"),\"\")","v":""}]
["",{"$f":"IF(C42=\"\",\"\",IF(C42=C41,B41,IF(MATCH(C42,C$22:C$103,0)>=(ROW()-51),MAX(B$22:B41)+1,INDIRECT(\"b\"&(MATCH(C42,C$22:C$103,0)+51),1))))","v":""},null,null,null,"",null,{"$f":"IF(F42=\"\",\"\",IF(F42<=13,\"Children\",IF(F42<=15,\"Cadet\",IF(F42<=17,\"Junior\",\"Senior\"))))","v":""},"",null,null,null,null,null,"","",{"$f":"IF(C42=\"\",\"\",IF(J42=\"Team\",\"Team\",IF(COUNTIF($C$22:$C$103,C42)-COUNTIFS($C$22:$C$103,C42,$J$22:$J$103,\"Team\")>COUNTIF($C$22:$C42,C42)-COUNTIFS($C$22:$C42,C42,$J$22:$J42,\"Team\"),\"\",COUNTIF($C$22:$C$103,C42)-COUNTIFS($C$22:$C$103,C42,$J$22:$J$103,\"Team\"))))","v":""},"",null,"",{"$f":"IF(T42=\"\",IF(L42=\"Belt & age\",IF(V42=\"\",IF(E42=\"m\",\"Boys \"&VLOOKUP(G42,INFO!B$19:C$27,2,0),\"Girls \"&VLOOKUP(G42,INFO!B$47:C$55,2,0)),V42),IF(L42=\"weight\",\"\",V42)),IF(J42=\"Team\",W42,IF(T42<14,\"Children\",IF(T42<16,\"Cadet\",IF(T42<18,\"Junior\",IF(T42<21,\"Under 21\",IF(T42<40,\"Senior\",\"Veterans\"))))&\" Opens\")))","v":""},{"$f":"IF(F42>=14,IF(L42=\"Belt & Age\",IF(G42=\"black\",\"NO SUCH DIVISION!!!\",\"Development\"),\"\"),\"\")","v":""}]
["",{"$f":"IF(C43=\"\",\"\",IF(C43=C42,B42,IF(MATCH(C43,C$22:C$103,0)>=(ROW()-51),MAX(B$22:B42)+1,INDIRECT(\"b\"&(MATCH(C43,C$22:C$103,0)+51),1))))","v":""},null,null,null,"",null,{"$f":"IF(F43=\"\",\"\",IF(F43<=13,\"Children\",IF(F43<=15,\"Cadet\",IF(F43<=17,\"Junior\",\"Senior\"))))","v":""},"",null,null,null,null,null,"","",{"$f":"IF(C43=\"\",\"\",IF(J43=\"Team\",\"Team\",IF(COUNTIF($C$22:$C$103,C43)-COUNTIFS($C$22:$C$103,C43,$J$22:$J$103,\"Team\")>COUNTIF($C$22:$C43,C43)-COUNTIFS($C$22:$C43,C43,$J$22:$J43,\"Team\"),\"\",COUNTIF($C$22:$C$103,C43)-COUNTIFS($C$22:$C$103,C43,$J$22:$J$103,\"Team\"))))","v":""},"",null,"",{"$f":"IF(T43=\"\",IF(L43=\"Belt & age\",IF(V43=\"\",IF(E43=\"m\",\"Boys \"&VLOOKUP(G43,INFO!B$19:C$27,2,0),\"Girls \"&VLOOKUP(G43,INFO!B$47:C$55,2,0)),V43),IF(L43=\"weight\",\"\",V43)),IF(J43=\"Team\",W43,IF(T43<14,\"Children\",IF(T43<16,\"Cadet\",IF(T43<18,\"Junior\",IF(T43<21,\"Under 21\",IF(T43<40,\"Senior\",\"Veterans\"))))&\" Opens\")))","v":""},{"$f":"IF(F43>=14,IF(L43=\"Belt & Age\",IF(G43=\"black\",\"NO SUCH DIVISION!!!\",\"Development\"),\"\"),\"\")","v":""}]
["",{"$f":"IF(C44=\"\",\"\",IF(C44=C43,B43,IF(MATCH(C44,C$22:C$103,0)>=(ROW()-51),MAX(B$22:B43)+1,INDIRECT(\"b\"&(MATCH(C44,C$22:C$103,0)+51),1))))","v":""},null,null,null,"",null,{"$f":"IF(F44=\"\",\"\",IF(F44<=13,\"Children\",IF(F44<=15,\"Cadet\",IF(F44<=17,\"Junior\",\"Senior\"))))","v":""},"",null,null,null,null,null,"","",{"$f":"IF(C44=\"\",\"\",IF(J44=\"Team\",\"Team\",IF(COUNTIF($C$22:$C$103,C44)-COUNTIFS($C$22:$C$103,C44,$J$22:$J$103,\"Team\")>COUNTIF($C$22:$C44,C44)-COUNTIFS($C$22:$C44,C44,$J$22:$J44,\"Team\"),\"\",COUNTIF($C$22:$C$103,C44)-COUNTIFS($C$22:$C$103,C44,$J$22:$J$103,\"Team\"))))","v":""},"",null,"",{"$f":"IF(T44=\"\",IF(L44=\"Belt & age\",IF(V44=\"\",IF(E44=\"m\",\"Boys \"&VLOOKUP(G44,INFO!B$19:C$27,2,0),\"Girls \"&VLOOKUP(G44,INFO!B$47:C$55,2,0)),V44),IF(L44=\"weight\",\"\",V44)),IF(J44=\"Team\",W44,IF(T44<14,\"Children\",IF(T44<16,\"Cadet\",IF(T44<18,\"Junior\",IF(T44<21,\"Under 21\",IF(T44<40,\"Senior\",\"Veterans\"))))&\" Opens\")))","v":""},{"$f":"IF(F44>=14,IF(L44=\"Belt & Age\",IF(G44=\"black\",\"NO SUCH DIVISION!!!\",\"Development\"),\"\"),\"\")","v":""}]
["",{"$f":"IF(C45=\"\",\"\",IF(C45=C44,B44,IF(MATCH(C45,C$22:C$103,0)>=(ROW()-51),MAX(B$22:B44)+1,INDIRECT(\"b\"&(MATCH(C45,C$22:C$103,0)+51),1))))","v":""},null,null,null,"",null,{"$f":"IF(F45=\"\",\"\",IF(F45<=13,\"Children\",IF(F45<=15,\"Cadet\",IF(F45<=17,\"Junior\",\"Senior\"))))","v":""},"",null,null,null,null,null,"","",{"$f":"IF(C45=\"\",\"\",IF(J45=\"Team\",\"Team\",IF(COUNTIF($C$22:$C$103,C45)-COUNTIFS($C$22:$C$103,C45,$J$22:$J$103,\"Team\")>COUNTIF($C$22:$C45,C45)-COUNTIFS($C$22:$C45,C45,$J$22:$J45,\"Team\"),\"\",COUNTIF($C$22:$C$103,C45)-COUNTIFS($C$22:$C$103,C45,$J$22:$J$103,\"Team\"))))","v":""},"",null,"",{"$f":"IF(T45=\"\",IF(L45=\"Belt & age\",IF(V45=\"\",IF(E45=\"m\",\"Boys \"&VLOOKUP(G45,INFO!B$19:C$27,2,0),\"Girls \"&VLOOKUP(G45,INFO!B$47:C$55,2,0)),V45),IF(L45=\"weight\",\"\",V45)),IF(J45=\"Team\",W45,IF(T45<14,\"Children\",IF(T45<16,\"Cadet\",IF(T45<18,\"Junior\",IF(T45<21,\"Under 21\",IF(T45<40,\"Senior\",\"Veterans\"))))&\" Opens\")))","v":""},{"$f":"IF(F45>=14,IF(L45=\"Belt & Age\",IF(G45=\"black\",\"NO SUCH DIVISION!!!\",\"Development\"),\"\"),\"\")","v":""}]
["",{"$f":"IF(C46=\"\",\"\",IF(C46=C45,B45,IF(MATCH(C46,C$22:C$103,0)>=(ROW()-51),MAX(B$22:B45)+1,INDIRECT(\"b\"&(MATCH(C46,C$22:C$103,0)+51),1))))","v":""},null,null,null,"",null,{"$f":"IF(F46=\"\",\"\",IF(F46<=13,\"Children\",IF(F46<=15,\"Cadet\",IF(F46<=17,\"Junior\",\"Senior\"))))","v":""},"",null,null,null,null,null,"","",{"$f":"IF(C46=\"\",\"\",IF(J46=\"Team\",\"Team\",IF(COUNTIF($C$22:$C$103,C46)-COUNTIFS($C$22:$C$103,C46,$J$22:$J$103,\"Team\")>COUNTIF($C$22:$C46,C46)-COUNTIFS($C$22:$C46,C46,$J$22:$J46,\"Team\"),\"\",COUNTIF($C$22:$C$103,C46)-COUNTIFS($C$22:$C$103,C46,$J$22:$J$103,\"Team\"))))","v":""},"",null,"",{"$f":"IF(T46=\"\",IF(L46=\"Belt & age\",IF(V46=\"\",IF(E46=\"m\",\"Boys \"&VLOOKUP(G46,INFO!B$19:C$27,2,0),\"Girls \"&VLOOKUP(G46,INFO!B$47:C$55,2,0)),V46),IF(L46=\"weight\",\"\",V46)),IF(J46=\"Team\",W46,IF(T46<14,\"Children\",IF(T46<16,\"Cadet\",IF(T46<18,\"Junior\",IF(T46<21,\"Under 21\",IF(T46<40,\"Senior\",\"Veterans\"))))&\" Opens\")))","v":""},{"$f":"IF(F46>=14,IF(L46=\"Belt & Age\",IF(G46=\"black\",\"NO SUCH DIVISION!!!\",\"Development\"),\"\"),\"\")","v":""}]
["",{"$f":"IF(C47=\"\",\"\",IF(C47=C46,B46,IF(MATCH(C47,C$22:C$103,0)>=(ROW()-51),MAX(B$22:B46)+1,INDIRECT(\"b\"&(MATCH(C47,C$22:C$103,0)+51),1))))","v":""},null,null,null,"",null,{"$f":"IF(F47=\"\",\"\",IF(F47<=13,\"Children\",IF(F47<=15,\"Cadet\",IF(F47<=17,\"Junior\",\"Senior\"))))","v":""},"",null,null,null,null,null,"","",{"$f":"IF(C47=\"\",\"\",IF(J47=\"Team\",\"Team\",IF(COUNTIF($C$22:$C$103,C47)-COUNTIFS($C$22:$C$103,C47,$J$22:$J$103,\"Team\")>COUNTIF($C$22:$C47,C47)-COUNTIFS($C$22:$C47,C47,$J$22:$J47,\"Team\"),\"\",COUNTIF($C$22:$C$103,C47)-COUNTIFS($C$22:$C$103,C47,$J$22:$J$103,\"Team\"))))","v":""},"",null,"",{"$f":"IF(T47=\"\",IF(L47=\"Belt & age\",IF(V47=\"\",IF(E47=\"m\",\"Boys \"&VLOOKUP(G47,INFO!B$19:C$27,2,0),\"Girls \"&VLOOKUP(G47,INFO!B$47:C$55,2,0)),V47),IF(L47=\"weight\",\"\",V47)),IF(J47=\"Team\",W47,IF(T47<14,\"Children\",IF(T47<16,\"Cadet\",IF(T47<18,\"Junior\",IF(T47<21,\"Under 21\",IF(T47<40,\"Senior\",\"Veterans\"))))&\" Opens\")))","v":""},{"$f":"IF(F47>=14,IF(L47=\"Belt & Age\",IF(G47=\"black\",\"NO SUCH DIVISION!!!\",\"Development\"),\"\"),\"\")","v":""}]
["",{"$f":"IF(C48=\"\",\"\",IF(C48=C47,B47,IF(MATCH(C48,C$22:C$103,0)>=(ROW()-51),MAX(B$22:B47)+1,INDIRECT(\"b\"&(MATCH(C48,C$22:C$103,0)+51),1))))","v":""},null,null,null,"",null,{"$f":"IF(F48=\"\",\"\",IF(F48<=13,\"Children\",IF(F48<=15,\"Cadet\",IF(F48<=17,\"Junior\",\"Senior\"))))","v":""},"",null,null,null,null,null,"","",{"$f":"IF(C48=\"\",\"\",IF(J48=\"Team\",\"Team\",IF(COUNTIF($C$22:$C$103,C48)-COUNTIFS($C$22:$C$103,C48,$J$22:$J$103,\"Team\")>COUNTIF($C$22:$C48,C48)-COUNTIFS($C$22:$C48,C48,$J$22:$J48,\"Team\"),\"\",COUNTIF($C$22:$C$103,C48)-COUNTIFS($C$22:$C$103,C48,$J$22:$J$103,\"Team\"))))","v":""},"",null,{"$f":"IF(L48=\"Open *\",IF(D48=\"\",\"\",IF(MONTH($Q$2)>=MONTH(D48),IF(MONTH($Q$2)=MONTH(D48),IF(DAY($Q$2)>=DAY(D48),YEAR($Q$2)-YEAR(D48),YEAR($Q$2)-YEAR(D48)-1),YEAR($Q$2)-YEAR(D48)),YEAR($Q$2)-YEAR(D48)-1)),\"\")","v":""},{"$f":"IF(T48=\"\",IF(L48=\"Belt & age\",IF(V48=\"\",IF(E48=\"m\",\"Boys \"&VLOOKUP(G48,INFO!B$19:C$27,2,0),\"Girls \"&VLOOKUP(G48,INFO!B$47:C$55,2,0)),V48),IF(L48=\"weight\",\"\",V48)),IF(J48=\"Team\",W48,IF(T48<14,\"Children\",IF(T48<16,\"Cadet\",IF(T48<18,\"Junior\",IF(T48<21,\"Under 21\",IF(T48<40,\"Senior\",\"Veterans\"))))&\" Opens\")))","v":""},{"$f":"IF(F48>=14,IF(L48=\"Belt & Age\",IF(G48=\"black\",\"NO SUCH DIVISION!!!\",\"Development\"),\"\"),\"\")","v":""}]
["",{"$f":"IF(C49=\"\",\"\",IF(C49=C48,B48,IF(MATCH(C49,C$22:C$103,0)>=(ROW()-51),MAX(B$22:B48)+1,INDIRECT(\"b\"&(MATCH(C49,C$22:C$103,0)+51),1))))","v":""},null,null,null,"",null,{"$f":"IF(F49=\"\",\"\",IF(F49<=13,\"Children\",IF(F49<=15,\"Cadet\",IF(F49<=17,\"Junior\",\"Senior\"))))","v":""},"",null,null,null,null,null,{"$f":"IF(J49=\"Individual\",IF(K49=\"Kata\",\"X\",IF(K49=\"Superkata\",\"S\",\"\")),IF(K49=\"kata\",\"T\",\"\"))","v":""},{"$f":"IF(J49=\"Individual\",IF(K49=\"Kumite\",\"X\",\"\"),IF(K49=\"kumite\",\"T\",\"\"))","v":""},{"$f":"IF(C49=\"\",\"\",IF(J49=\"Team\",\"Team\",IF(COUNTIF($C$22:$C$103,C49)-COUNTIFS($C$22:$C$103,C49,$J$22:$J$103,\"Team\")>COUNTIF($C$22:$C49,C49)-COUNTIFS($C$22:$C49,C49,$J$22:$J49,\"Team\"),\"\",COUNTIF($C$22:$C$103,C49)-COUNTIFS($C$22:$C$103,C49,$J$22:$J$103,\"Team\"))))","v":""},"",null,"",{"$f":"IF(T49=\"\",IF(L49=\"Belt & age\",IF(V49=\"\",IF(E49=\"m\",\"Boys \"&VLOOKUP(G49,INFO!B$19:C$27,2,0),\"Girls \"&VLOOKUP(G49,INFO!B$47:C$55,2,0)),V49),IF(L49=\"weight\",\"\",V49)),IF(J49=\"Team\",W49,IF(T49<14,\"Children\",IF(T49<16,\"Cadet\",IF(T49<18,\"Junior\",IF(T49<21,\"Under 21\",IF(T49<40,\"Senior\",\"Veterans\"))))&\" Opens\")))","v":""},{"$f":"IF(F49>=14,IF(L49=\"Belt & Age\",IF(G49=\"black\",\"NO SUCH DIVISION!!!\",\"Development\"),\"\"),\"\")","v":""}]
["",{"$f":"IF(C50=\"\",\"\",IF(C50=C49,B49,IF(MATCH(C50,C$22:C$103,0)>=(ROW()-51),MAX(B$22:B49)+1,INDIRECT(\"b\"&(MATCH(C50,C$22:C$103,0)+51),1))))","v":""},null,null,null,"",null,{"$f":"IF(F50=\"\",\"\",IF(F50<=13,\"Children\",IF(F50<=15,\"Cadet\",IF(F50<=17,\"Junior\",\"Senior\"))))","v":""},"",null,null,null,null,null,"","",{"$f":"IF(C50=\"\",\"\",IF(J50=\"Team\",\"Team\",IF(COUNTIF($C$22:$C$103,C50)-COUNTIFS($C$22:$C$103,C50,$J$22:$J$103,\"Team\")>COUNTIF($C$22:$C50,C50)-COUNTIFS($C$22:$C50,C50,$J$22:$J50,\"Team\"),\"\",COUNTIF($C$22:$C$103,C50)-COUNTIFS($C$22:$C$103,C50,$J$22:$J$103,\"Team\"))))","v":""},"",null,"",{"$f":"IF(T50=\"\",IF(L50=\"Belt & age\",IF(V50=\"\",IF(E50=\"m\",\"Boys \"&VLOOKUP(G50,INFO!B$19:C$27,2,0),\"Girls \"&VLOOKUP(G50,INFO!B$47:C$55,2,0)),V50),IF(L50=\"weight\",\"\",V50)),IF(J50=\"Team\",W50,IF(T50<14,\"Children\",IF(T50<16,\"Cadet\",IF(T50<18,\"Junior\",IF(T50<21,\"Under 21\",IF(T50<40,\"Senior\",\"Veterans\"))))&\" Opens\")))","v":""},{"$f":"IF(F50>=14,IF(L50=\"Belt & Age\",IF(G50=\"black\",\"NO SUCH DIVISION!!!\",\"Development\"),\"\"),\"\")","v":""}]
["",{"$f":"IF(C51=\"\",\"\",IF(C51=C50,B50,IF(MATCH(C51,C$22:C$103,0)>=(ROW()-51),MAX(B$22:B50)+1,INDIRECT(\"b\"&(MATCH(C51,C$22:C$103,0)+51),1))))","v":""},null,null,null,"",null,{"$f":"IF(F51=\"\",\"\",IF(F51<=13,\"Children\",IF(F51<=15,\"Cadet\",IF(F51<=17,\"Junior\",\"Senior\"))))","v":""},"",null,null,null,null,null,"","",{"$f":"IF(C51=\"\",\"\",IF(J51=\"Team\",\"Team\",IF(COUNTIF($C$22:$C$103,C51)-COUNTIFS($C$22:$C$103,C51,$J$22:$J$103,\"Team\")>COUNTIF($C$22:$C51,C51)-COUNTIFS($C$22:$C51,C51,$J$22:$J51,\"Team\"),\"\",COUNTIF($C$22:$C$103,C51)-COUNTIFS($C$22:$C$103,C51,$J$22:$J$103,\"Team\"))))","v":""},"",null,"",{"$f":"IF(T51=\"\",IF(L51=\"Belt & age\",IF(V51=\"\",IF(E51=\"m\",\"Boys \"&VLOOKUP(G51,INFO!B$19:C$27,2,0),\"Girls \"&VLOOKUP(G51,INFO!B$47:C$55,2,0)),V51),IF(L51=\"weight\",\"\",V51)),IF(J51=\"Team\",W51,IF(T51<14,\"Children\",IF(T51<16,\"Cadet\",IF(T51<18,\"Junior\",IF(T51<21,\"Under 21\",IF(T51<40,\"Senior\",\"Veterans\"))))&\" Opens\")))","v":""},{"$f":"IF(F51>=14,IF(L51=\"Belt & Age\",IF(G51=\"black\",\"NO SUCH DIVISION!!!\",\"Development\"),\"\"),\"\")","v":""}]
["",{"$f":"IF(C52=\"\",\"\",IF(C52=C51,B51,IF(MATCH(C52,C$22:C$103,0)>=(ROW()-51),MAX(B$22:B51)+1,INDIRECT(\"b\"&(MATCH(C52,C$22:C$103,0)+51),1))))","v":""},null,null,null,"",null,{"$f":"IF(F52=\"\",\"\",IF(F52<=13,\"Children\",IF(F52<=15,\"Cadet\",IF(F52<=17,\"Junior\",\"Senior\"))))","v":""},"",null,null,null,null,null,"","",{"$f":"IF(C52=\"\",\"\",IF(J52=\"Team\",\"Team\",IF(COUNTIF($C$22:$C$103,C52)-COUNTIFS($C$22:$C$103,C52,$J$22:$J$103,\"Team\")>COUNTIF($C$22:$C52,C52)-COUNTIFS($C$22:$C52,C52,$J$22:$J52,\"Team\"),\"\",COUNTIF($C$22:$C$103,C52)-COUNTIFS($C$22:$C$103,C52,$J$22:$J$103,\"Team\"))))","v":""},"",null,"",{"$f":"IF(T52=\"\",IF(L52=\"Belt & age\",IF(V52=\"\",IF(E52=\"m\",\"Boys \"&VLOOKUP(G52,INFO!B$19:C$27,2,0),\"Girls \"&VLOOKUP(G52,INFO!B$47:C$55,2,0)),V52),IF(L52=\"weight\",\"\",V52)),IF(J52=\"Team\",W52,IF(T52<14,\"Children\",IF(T52<16,\"Cadet\",IF(T52<18,\"Junior\",IF(T52<21,\"Under 21\",IF(T52<40,\"Senior\",\"Veterans\"))))&\" Opens\")))","v":""},{"$f":"IF(F52>=14,IF(L52=\"Belt & Age\",IF(G52=\"black\",\"NO SUCH DIVISION!!!\",\"Development\"),\"\"),\"\")","v":""}]
["",{"$f":"IF(C53=\"\",\"\",IF(C53=C52,B52,IF(MATCH(C53,C$22:C$103,0)>=(ROW()-51),MAX(B$22:B52)+1,INDIRECT(\"b\"&(MATCH(C53,C$22:C$103,0)+51),1))))","v":""},null,null,null,"",null,{"$f":"IF(F53=\"\",\"\",IF(F53<=13,\"Children\",IF(F53<=15,\"Cadet\",IF(F53<=17,\"Junior\",\"Senior\"))))","v":""},"",null,null,null,null,null,"","",{"$f":"IF(C53=\"\",\"\",IF(J53=\"Team\",\"Team\",IF(COUNTIF($C$22:$C$103,C53)-COUNTIFS($C$22:$C$103,C53,$J$22:$J$103,\"Team\")>COUNTIF($C$22:$C53,C53)-COUNTIFS($C$22:$C53,C53,$J$22:$J53,\"Team\"),\"\",COUNTIF($C$22:$C$103,C53)-COUNTIFS($C$22:$C$103,C53,$J$22:$J$103,\"Team\"))))","v":""},"",null,"",{"$f":"IF(T53=\"\",IF(L53=\"Belt & age\",IF(V53=\"\",IF(E53=\"m\",\"Boys \"&VLOOKUP(G53,INFO!B$19:C$27,2,0),\"Girls \"&VLOOKUP(G53,INFO!B$47:C$55,2,0)),V53),IF(L53=\"weight\",\"\",V53)),IF(J53=\"Team\",W53,IF(T53<14,\"Children\",IF(T53<16,\"Cadet\",IF(T53<18,\"Junior\",IF(T53<21,\"Under 21\",IF(T53<40,\"Senior\",\"Veterans\"))))&\" Opens\")))","v":""},{"$f":"IF(F53>=14,IF(L53=\"Belt & Age\",IF(G53=\"black\",\"NO SUCH DIVISION!!!\",\"Development\"),\"\"),\"\")","v":""}]
["",{"$f":"IF(C54=\"\",\"\",IF(C54=C53,B53,IF(MATCH(C54,C$22:C$103,0)>=(ROW()-51),MAX(B$22:B53)+1,INDIRECT(\"b\"&(MATCH(C54,C$22:C$103,0)+51),1))))","v":""},null,null,null,"",null,{"$f":"IF(F54=\"\",\"\",IF(F54<=13,\"Children\",IF(F54<=15,\"Cadet\",IF(F54<=17,\"Junior\",\"Senior\"))))","v":""},"",null,null,null,null,null,"","",{"$f":"IF(C54=\"\",\"\",IF(J54=\"Team\",\"Team\",IF(COUNTIF($C$22:$C$103,C54)-COUNTIFS($C$22:$C$103,C54,$J$22:$J$103,\"Team\")>COUNTIF($C$22:$C54,C54)-COUNTIFS($C$22:$C54,C54,$J$22:$J54,\"Team\"),\"\",COUNTIF($C$22:$C$103,C54)-COUNTIFS($C$22:$C$103,C54,$J$22:$J$103,\"Team\"))))","v":""},{"$f":"IF(Q54=\"\",\"\",IF(Q54=1,150,IF(Q54=2,250,IF(Q54=3,350,IF(Q54=\"team\",210/3,400)))))","v":""},null,"",{"$f":"IF(T54=\"\",IF(L54=\"Belt & age\",IF(V54=\"\",IF(E54=\"m\",\"Boys \"&VLOOKUP(G54,INFO!B$19:C$27,2,0),\"Girls \"&VLOOKUP(G54,INFO!B$47:C$55,2,0)),V54),IF(L54=\"weight\",\"\",V54)),IF(J54=\"Team\",W54,IF(T54<14,\"Children\",IF(T54<16,\"Cadet\",IF(T54<18,\"Junior\",IF(T54<21,\"Under 21\",IF(T54<40,\"Senior\",\"Veterans\"))))&\" Opens\")))","v":""},{"$f":"IF(F54>=14,IF(L54=\"Belt & Age\",IF(G54=\"black\",\"NO SUCH DIVISION!!!\",\"Development\"),\"\"),\"\")","v":""}]
["",{"$f":"IF(C55=\"\",\"\",IF(C55=C54,B54,IF(MATCH(C55,C$22:C$103,0)>=(ROW()-51),MAX(B$22:B54)+1,INDIRECT(\"b\"&(MATCH(C55,C$22:C$103,0)+51),1))))","v":""},null,null,null,"",null,{"$f":"IF(F55=\"\",\"\",IF(F55<=13,\"Children\",IF(F55<=15,\"Cadet\",IF(F55<=17,\"Junior\",\"Senior\"))))","v":""},"",null,null,null,null,null,"","",{"$f":"IF(C55=\"\",\"\",IF(J55=\"Team\",\"Team\",IF(COUNTIF($C$22:$C$103,C55)-COUNTIFS($C$22:$C$103,C55,$J$22:$J$103,\"Team\")>COUNTIF($C$22:$C55,C55)-COUNTIFS($C$22:$C55,C55,$J$22:$J55,\"Team\"),\"\",COUNTIF($C$22:$C$103,C55)-COUNTIFS($C$22:$C$103,C55,$J$22:$J$103,\"Team\"))))","v":""},"",null,"",{"$f":"IF(T55=\"\",IF(L55=\"Belt & age\",IF(V55=\"\",IF(E55=\"m\",\"Boys \"&VLOOKUP(G55,INFO!B$19:C$27,2,0),\"Girls \"&VLOOKUP(G55,INFO!B$47:C$55,2,0)),V55),IF(L55=\"weight\",\"\",V55)),IF(J55=\"Team\",W55,IF(T55<14,\"Children\",IF(T55<16,\"Cadet\",IF(T55<18,\"Junior\",IF(T55<21,\"Under 21\",IF(T55<40,\"Senior\",\"Veterans\"))))&\" Opens\")))","v":""},{"$f":"IF(F55>=14,IF(L55=\"Belt & Age\",IF(G55=\"black\",\"NO SUCH DIVISION!!!\",\"Development\"),\"\"),\"\")","v":""}]
["",{"$f":"IF(C56=\"\",\"\",IF(C56=C55,B55,IF(MATCH(C56,C$22:C$103,0)>=(ROW()-51),MAX(B$22:B55)+1,INDIRECT(\"b\"&(MATCH(C56,C$22:C$103,0)+51),1))))","v":""},null,null,null,"",null,{"$f":"IF(F56=\"\",\"\",IF(F56<=13,\"Children\",IF(F56<=15,\"Cadet\",IF(F56<=17,\"Junior\",\"Senior\"))))","v":""},"",null,null,null,null,null,"","",{"$f":"IF(C56=\"\",\"\",IF(J56=\"Team\",\"Team\",IF(COUNTIF($C$22:$C$103,C56)-COUNTIFS($C$22:$C$103,C56,$J$22:$J$103,\"Team\")>COUNTIF($C$22:$C56,C56)-COUNTIFS($C$22:$C56,C56,$J$22:$J56,\"Team\"),\"\",COUNTIF($C$22:$C$103,C56)-COUNTIFS($C$22:$C$103,C56,$J$22:$J$103,\"Team\"))))","v":""},"",null,"",{"$f":"IF(T56=\"\",IF(L56=\"Belt & age\",IF(V56=\"\",IF(E56=\"m\",\"Boys \"&VLOOKUP(G56,INFO!B$19:C$27,2,0),\"Girls \"&VLOOKUP(G56,INFO!B$47:C$55,2,0)),V56),IF(L56=\"weight\",\"\",V56)),IF(J56=\"Team\",W56,IF(T56<14,\"Children\",IF(T56<16,\"Cadet\",IF(T56<18,\"Junior\",IF(T56<21,\"Under 21\",IF(T56<40,\"Senior\",\"Veterans\"))))&\" Opens\")))","v":""},{"$f":"IF(F56>=14,IF(L56=\"Belt & Age\",IF(G56=\"black\",\"NO SUCH DIVISION!!!\",\"Development\"),\"\"),\"\")","v":""}]
["",{"$f":"IF(C57=\"\",\"\",IF(C57=C56,B56,IF(MATCH(C57,C$22:C$103,0)>=(ROW()-51),MAX(B$22:B56)+1,INDIRECT(\"b\"&(MATCH(C57,C$22:C$103,0)+51),1))))","v":""},null,null,null,"",null,{"$f":"IF(F57=\"\",\"\",IF(F57<=13,\"Children\",IF(F57<=15,\"Cadet\",IF(F57<=17,\"Junior\",\"Senior\"))))","v":""},"",null,null,null,null,null,"","",{"$f":"IF(C57=\"\",\"\",IF(J57=\"Team\",\"Team\",IF(COUNTIF($C$22:$C$103,C57)-COUNTIFS($C$22:$C$103,C57,$J$22:$J$103,\"Team\")>COUNTIF($C$22:$C57,C57)-COUNTIFS($C$22:$C57,C57,$J$22:$J57,\"Team\"),\"\",COUNTIF($C$22:$C$103,C57)-COUNTIFS($C$22:$C$103,C57,$J$22:$J$103,\"Team\"))))","v":""},"",null,"",{"$f":"IF(T57=\"\",IF(L57=\"Belt & age\",IF(V57=\"\",IF(E57=\"m\",\"Boys \"&VLOOKUP(G57,INFO!B$19:C$27,2,0),\"Girls \"&VLOOKUP(G57,INFO!B$47:C$55,2,0)),V57),IF(L57=\"weight\",\"\",V57)),IF(J57=\"Team\",W57,IF(T57<14,\"Children\",IF(T57<16,\"Cadet\",IF(T57<18,\"Junior\",IF(T57<21,\"Under 21\",IF(T57<40,\"Senior\",\"Veterans\"))))&\" Opens\")))","v":""},{"$f":"IF(F57>=14,IF(L57=\"Belt & Age\",IF(G57=\"black\",\"NO SUCH DIVISION!!!\",\"Development\"),\"\"),\"\")","v":""}]
["",{"$f":"IF(C58=\"\",\"\",IF(C58=C57,B57,IF(MATCH(C58,C$22:C$103,0)>=(ROW()-51),MAX(B$22:B57)+1,INDIRECT(\"b\"&(MATCH(C58,C$22:C$103,0)+51),1))))","v":""},null,null,null,"",null,{"$f":"IF(F58=\"\",\"\",IF(F58<=13,\"Children\",IF(F58<=15,\"Cadet\",IF(F58<=17,\"Junior\",\"Senior\"))))","v":""},"",null,null,null,null,null,"","",{"$f":"IF(C58=\"\",\"\",IF(J58=\"Team\",\"Team\",IF(COUNTIF($C$22:$C$103,C58)-COUNTIFS($C$22:$C$103,C58,$J$22:$J$103,\"Team\")>COUNTIF($C$22:$C58,C58)-COUNTIFS($C$22:$C58,C58,$J$22:$J58,\"Team\"),\"\",COUNTIF($C$22:$C$103,C58)-COUNTIFS($C$22:$C$103,C58,$J$22:$J$103,\"Team\"))))","v":""},"",null,"",{"$f":"IF(T58=\"\",IF(L58=\"Belt & age\",IF(V58=\"\",IF(E58=\"m\",\"Boys \"&VLOOKUP(G58,INFO!B$19:C$27,2,0),\"Girls \"&VLOOKUP(G58,INFO!B$47:C$55,2,0)),V58),IF(L58=\"weight\",\"\",V58)),IF(J58=\"Team\",W58,IF(T58<14,\"Children\",IF(T58<16,\"Cadet\",IF(T58<18,\"Junior\",IF(T58<21,\"Under 21\",IF(T58<40,\"Senior\",\"Veterans\"))))&\" Opens\")))","v":""},{"$f":"IF(F58>=14,IF(L58=\"Belt & Age\",IF(G58=\"black\",\"NO SUCH DIVISION!!!\",\"Development\"),\"\"),\"\")","v":""}]
["",{"$f":"IF(C59=\"\",\"\",IF(C59=C58,B58,IF(MATCH(C59,C$22:C$103,0)>=(ROW()-51),MAX(B$22:B58)+1,INDIRECT(\"b\"&(MATCH(C59,C$22:C$103,0)+51),1))))","v":""},null,null,null,"",null,{"$f":"IF(F59=\"\",\"\",IF(F59<=13,\"Children\",IF(F59<=15,\"Cadet\",IF(F59<=17,\"Junior\",\"Senior\"))))","v":""},"",null,null,null,null,null,"","",{"$f":"IF(C59=\"\",\"\",IF(J59=\"Team\",\"Team\",IF(COUNTIF($C$22:$C$103,C59)-COUNTIFS($C$22:$C$103,C59,$J$22:$J$103,\"Team\")>COUNTIF($C$22:$C59,C59)-COUNTIFS($C$22:$C59,C59,$J$22:$J59,\"Team\"),\"\",COUNTIF($C$22:$C$103,C59)-COUNTIFS($C$22:$C$103,C59,$J$22:$J$103,\"Team\"))))","v":""},"",null,"",{"$f":"IF(T59=\"\",IF(L59=\"Belt & age\",IF(V59=\"\",IF(E59=\"m\",\"Boys \"&VLOOKUP(G59,INFO!B$19:C$27,2,0),\"Girls \"&VLOOKUP(G59,INFO!B$47:C$55,2,0)),V59),IF(L59=\"weight\",\"\",V59)),IF(J59=\"Team\",W59,IF(T59<14,\"Children\",IF(T59<16,\"Cadet\",IF(T59<18,\"Junior\",IF(T59<21,\"Under 21\",IF(T59<40,\"Senior\",\"Veterans\"))))&\" Opens\")))","v":""},{"$f":"IF(F59>=14,IF(L59=\"Belt & Age\",IF(G59=\"black\",\"NO SUCH DIVISION!!!\",\"Development\"),\"\"),\"\")","v":""}]
["",{"$f":"IF(C60=\"\",\"\",IF(C60=C59,B59,IF(MATCH(C60,C$22:C$103,0)>=(ROW()-51),MAX(B$22:B59)+1,INDIRECT(\"b\"&(MATCH(C60,C$22:C$103,0)+51),1))))","v":""},null,null,null,"",null,{"$f":"IF(F60=\"\",\"\",IF(F60<=13,\"Children\",IF(F60<=15,\"Cadet\",IF(F60<=17,\"Junior\",\"Senior\"))))","v":""},"",null,null,null,null,null,"","",{"$f":"IF(C60=\"\",\"\",IF(J60=\"Team\",\"Team\",IF(COUNTIF($C$22:$C$103,C60)-COUNTIFS($C$22:$C$103,C60,$J$22:$J$103,\"Team\")>COUNTIF($C$22:$C60,C60)-COUNTIFS($C$22:$C60,C60,$J$22:$J60,\"Team\"),\"\",COUNTIF($C$22:$C$103,C60)-COUNTIFS($C$22:$C$103,C60,$J$22:$J$103,\"Team\"))))","v":""},"",null,"",{"$f":"IF(T60=\"\",IF(L60=\"Belt & age\",IF(V60=\"\",IF(E60=\"m\",\"Boys \"&VLOOKUP(G60,INFO!B$19:C$27,2,0),\"Girls \"&VLOOKUP(G60,INFO!B$47:C$55,2,0)),V60),IF(L60=\"weight\",\"\",V60)),IF(J60=\"Team\",W60,IF(T60<14,\"Children\",IF(T60<16,\"Cadet\",IF(T60<18,\"Junior\",IF(T60<21,\"Under 21\",IF(T60<40,\"Senior\",\"Veterans\"))))&\" Opens\")))","v":""},{"$f":"IF(F60>=14,IF(L60=\"Belt & Age\",IF(G60=\"black\",\"NO SUCH DIVISION!!!\",\"Development\"),\"\"),\"\")","v":""}]
["",{"$f":"IF(C61=\"\",\"\",IF(C61=C60,B60,IF(MATCH(C61,C$22:C$103,0)>=(ROW()-51),MAX(B$22:B60)+1,INDIRECT(\"b\"&(MATCH(C61,C$22:C$103,0)+51),1))))","v":""},null,null,null,"",null,{"$f":"IF(F61=\"\",\"\",IF(F61<=13,\"Children\",IF(F61<=15,\"Cadet\",IF(F61<=17,\"Junior\",\"Senior\"))))","v":""},"",null,null,null,null,null,"","",{"$f":"IF(C61=\"\",\"\",IF(J61=\"Team\",\"Team\",IF(COUNTIF($C$22:$C$103,C61)-COUNTIFS($C$22:$C$103,C61,$J$22:$J$103,\"Team\")>COUNTIF($C$22:$C61,C61)-COUNTIFS($C$22:$C61,C61,$J$22:$J61,\"Team\"),\"\",COUNTIF($C$22:$C$103,C61)-COUNTIFS($C$22:$C$103,C61,$J$22:$J$103,\"Team\"))))","v":""},"",null,"",{"$f":"IF(T61=\"\",IF(L61=\"Belt & age\",IF(V61=\"\",IF(E61=\"m\",\"Boys \"&VLOOKUP(G61,INFO!B$19:C$27,2,0),\"Girls \"&VLOOKUP(G61,INFO!B$47:C$55,2,0)),V61),IF(L61=\"weight\",\"\",V61)),IF(J61=\"Team\",W61,IF(T61<14,\"Children\",IF(T61<16,\"Cadet\",IF(T61<18,\"Junior\",IF(T61<21,\"Under 21\",IF(T61<40,\"Senior\",\"Veterans\"))))&\" Opens\")))","v":""},{"$f":"IF(F61>=14,IF(L61=\"Belt & Age\",IF(G61=\"black\",\"NO SUCH DIVISION!!!\",\"Development\"),\"\"),\"\")","v":""}]
["",{"$f":"IF(C62=\"\",\"\",IF(C62=C61,B61,IF(MATCH(C62,C$22:C$103,0)>=(ROW()-51),MAX(B$22:B61)+1,INDIRECT(\"b\"&(MATCH(C62,C$22:C$103,0)+51),1))))","v":""},null,null,null,"",null,{"$f":"IF(F62=\"\",\"\",IF(F62<=13,\"Children\",IF(F62<=15,\"Cadet\",IF(F62<=17,\"Junior\",\"Senior\"))))","v":""},"",null,null,null,null,null,"","",{"$f":"IF(C62=\"\",\"\",IF(J62=\"Team\",\"Team\",IF(COUNTIF($C$22:$C$103,C62)-COUNTIFS($C$22:$C$103,C62,$J$22:$J$103,\"Team\")>COUNTIF($C$22:$C62,C62)-COUNTIFS($C$22:$C62,C62,$J$22:$J62,\"Team\"),\"\",COUNTIF($C$22:$C$103,C62)-COUNTIFS($C$22:$C$103,C62,$J$22:$J$103,\"Team\"))))","v":""},"",null,"",{"$f":"IF(T62=\"\",IF(L62=\"Belt & age\",IF(V62=\"\",IF(E62=\"m\",\"Boys \"&VLOOKUP(G62,INFO!B$19:C$27,2,0),\"Girls \"&VLOOKUP(G62,INFO!B$47:C$55,2,0)),V62),IF(L62=\"weight\",\"\",V62)),IF(J62=\"Team\",W62,IF(T62<14,\"Children\",IF(T62<16,\"Cadet\",IF(T62<18,\"Junior\",IF(T62<21,\"Under 21\",IF(T62<40,\"Senior\",\"Veterans\"))))&\" Opens\")))","v":""},{"$f":"IF(F62>=14,IF(L62=\"Belt & Age\",IF(G62=\"black\",\"NO SUCH DIVISION!!!\",\"Development\"),\"\"),\"\")","v":""}]
["",{"$f":"IF(C63=\"\",\"\",IF(C63=C62,B62,IF(MATCH(C63,C$22:C$103,0)>=(ROW()-51),MAX(B$22:B62)+1,INDIRECT(\"b\"&(MATCH(C63,C$22:C$103,0)+51),1))))","v":""},null,null,null,"",null,{"$f":"IF(F63=\"\",\"\",IF(F63<=13,\"Children\",IF(F63<=15,\"Cadet\",IF(F63<=17,\"Junior\",\"Senior\"))))","v":""},"",null,null,null,null,null,"","",{"$f":"IF(C63=\"\",\"\",IF(J63=\"Team\",\"Team\",IF(COUNTIF($C$22:$C$103,C63)-COUNTIFS($C$22:$C$103,C63,$J$22:$J$103,\"Team\")>COUNTIF($C$22:$C63,C63)-COUNTIFS($C$22:$C63,C63,$J$22:$J63,\"Team\"),\"\",COUNTIF($C$22:$C$103,C63)-COUNTIFS($C$22:$C$103,C63,$J$22:$J$103,\"Team\"))))","v":""},"",null,"",{"$f":"IF(T63=\"\",IF(L63=\"Belt & age\",IF(V63=\"\",IF(E63=\"m\",\"Boys \"&VLOOKUP(G63,INFO!B$19:C$27,2,0),\"Girls \"&VLOOKUP(G63,INFO!B$47:C$55,2,0)),V63),IF(L63=\"weight\",\"\",V63)),IF(J63=\"Team\",W63,IF(T63<14,\"Children\",IF(T63<16,\"Cadet\",IF(T63<18,\"Junior\",IF(T63<21,\"Under 21\",IF(T63<40,\"Senior\",\"Veterans\"))))&\" Opens\")))","v":""},{"$f":"IF(F63>=14,IF(L63=\"Belt & Age\",IF(G63=\"black\",\"NO SUCH DIVISION!!!\",\"Development\"),\"\"),\"\")","v":""}]
["",{"$f":"IF(C64=\"\",\"\",IF(C64=C63,B63,IF(MATCH(C64,C$22:C$103,0)>=(ROW()-51),MAX(B$22:B63)+1,INDIRECT(\"b\"&(MATCH(C64,C$22:C$103,0)+51),1))))","v":""},null,null,null,"",null,{"$f":"IF(F64=\"\",\"\",IF(F64<=13,\"Children\",IF(F64<=15,\"Cadet\",IF(F64<=17,\"Junior\",\"Senior\"))))","v":""},"",null,null,null,null,null,"","",{"$f":"IF(C64=\"\",\"\",IF(J64=\"Team\",\"Team\",IF(COUNTIF($C$22:$C$103,C64)-COUNTIFS($C$22:$C$103,C64,$J$22:$J$103,\"Team\")>COUNTIF($C$22:$C64,C64)-COUNTIFS($C$22:$C64,C64,$J$22:$J64,\"Team\"),\"\",COUNTIF($C$22:$C$103,C64)-COUNTIFS($C$22:$C$103,C64,$J$22:$J$103,\"Team\"))))","v":""},"",null,"",{"$f":"IF(T64=\"\",IF(L64=\"Belt & age\",IF(V64=\"\",IF(E64=\"m\",\"Boys \"&VLOOKUP(G64,INFO!B$19:C$27,2,0),\"Girls \"&VLOOKUP(G64,INFO!B$47:C$55,2,0)),V64),IF(L64=\"weight\",\"\",V64)),IF(J64=\"Team\",W64,IF(T64<14,\"Children\",IF(T64<16,\"Cadet\",IF(T64<18,\"Junior\",IF(T64<21,\"Under 21\",IF(T64<40,\"Senior\",\"Veterans\"))))&\" Opens\")))","v":""},{"$f":"IF(F64>=14,IF(L64=\"Belt & Age\",IF(G64=\"black\",\"NO SUCH DIVISION!!!\",\"Development\"),\"\"),\"\")","v":""}]
["",{"$f":"IF(C65=\"\",\"\",IF(C65=C64,B64,IF(MATCH(C65,C$22:C$103,0)>=(ROW()-51),MAX(B$22:B64)+1,INDIRECT(\"b\"&(MATCH(C65,C$22:C$103,0)+51),1))))","v":""},null,null,null,"",null,{"$f":"IF(F65=\"\",\"\",IF(F65<=13,\"Children\",IF(F65<=15,\"Cadet\",IF(F65<=17,\"Junior\",\"Senior\"))))","v":""},"",null,null,null,null,null,"","",{"$f":"IF(C65=\"\",\"\",IF(J65=\"Team\",\"Team\",IF(COUNTIF($C$22:$C$103,C65)-COUNTIFS($C$22:$C$103,C65,$J$22:$J$103,\"Team\")>COUNTIF($C$22:$C65,C65)-COUNTIFS($C$22:$C65,C65,$J$22:$J65,\"Team\"),\"\",COUNTIF($C$22:$C$103,C65)-COUNTIFS($C$22:$C$103,C65,$J$22:$J$103,\"Team\"))))","v":""},"",null,"",{"$f":"IF(T65=\"\",IF(L65=\"Belt & age\",IF(V65=\"\",IF(E65=\"m\",\"Boys \"&VLOOKUP(G65,INFO!B$19:C$27,2,0),\"Girls \"&VLOOKUP(G65,INFO!B$47:C$55,2,0)),V65),IF(L65=\"weight\",\"\",V65)),IF(J65=\"Team\",W65,IF(T65<14,\"Children\",IF(T65<16,\"Cadet\",IF(T65<18,\"Junior\",IF(T65<21,\"Under 21\",IF(T65<40,\"Senior\",\"Veterans\"))))&\" Opens\")))","v":""},{"$f":"IF(F65>=14,IF(L65=\"Belt & Age\",IF(G65=\"black\",\"NO SUCH DIVISION!!!\",\"Development\"),\"\"),\"\")","v":""}]
["",{"$f":"IF(C66=\"\",\"\",IF(C66=C65,B65,IF(MATCH(C66,C$22:C$103,0)>=(ROW()-51),MAX(B$22:B65)+1,INDIRECT(\"b\"&(MATCH(C66,C$22:C$103,0)+51),1))))","v":""},null,null,null,"",null,{"$f":"IF(F66=\"\",\"\",IF(F66<=13,\"Children\",IF(F66<=15,\"Cadet\",IF(F66<=17,\"Junior\",\"Senior\"))))","v":""},"",null,null,null,null,null,"","",{"$f":"IF(C66=\"\",\"\",IF(J66=\"Team\",\"Team\",IF(COUNTIF($C$22:$C$103,C66)-COUNTIFS($C$22:$C$103,C66,$J$22:$J$103,\"Team\")>COUNTIF($C$22:$C66,C66)-COUNTIFS($C$22:$C66,C66,$J$22:$J66,\"Team\"),\"\",COUNTIF($C$22:$C$103,C66)-COUNTIFS($C$22:$C$103,C66,$J$22:$J$103,\"Team\"))))","v":""},"",null,"",{"$f":"IF(T66=\"\",IF(L66=\"Belt & age\",IF(V66=\"\",IF(E66=\"m\",\"Boys \"&VLOOKUP(G66,INFO!B$19:C$27,2,0),\"Girls \"&VLOOKUP(G66,INFO!B$47:C$55,2,0)),V66),IF(L66=\"weight\",\"\",V66)),IF(J66=\"Team\",W66,IF(T66<14,\"Children\",IF(T66<16,\"Cadet\",IF(T66<18,\"Junior\",IF(T66<21,\"Under 21\",IF(T66<40,\"Senior\",\"Veterans\"))))&\" Opens\")))","v":""},{"$f":"IF(F66>=14,IF(L66=\"Belt & Age\",IF(G66=\"black\",\"NO SUCH DIVISION!!!\",\"Development\"),\"\"),\"\")","v":""}]
["",{"$f":"IF(C67=\"\",\"\",IF(C67=C66,B66,IF(MATCH(C67,C$22:C$103,0)>=(ROW()-51),MAX(B$22:B66)+1,INDIRECT(\"b\"&(MATCH(C67,C$22:C$103,0)+51),1))))","v":""},null,null,null,"",null,{"$f":"IF(F67=\"\",\"\",IF(F67<=13,\"Children\",IF(F67<=15,\"Cadet\",IF(F67<=17,\"Junior\",\"Senior\"))))","v":""},"",null,null,null,null,null,"","",{"$f":"IF(C67=\"\",\"\",IF(J67=\"Team\",\"Team\",IF(COUNTIF($C$22:$C$103,C67)-COUNTIFS($C$22:$C$103,C67,$J$22:$J$103,\"Team\")>COUNTIF($C$22:$C67,C67)-COUNTIFS($C$22:$C67,C67,$J$22:$J67,\"Team\"),\"\",COUNTIF($C$22:$C$103,C67)-COUNTIFS($C$22:$C$103,C67,$J$22:$J$103,\"Team\"))))","v":""},"",null,"",{"$f":"IF(T67=\"\",IF(L67=\"Belt & age\",IF(V67=\"\",IF(E67=\"m\",\"Boys \"&VLOOKUP(G67,INFO!B$19:C$27,2,0),\"Girls \"&VLOOKUP(G67,INFO!B$47:C$55,2,0)),V67),IF(L67=\"weight\",\"\",V67)),IF(J67=\"Team\",W67,IF(T67<14,\"Children\",IF(T67<16,\"Cadet\",IF(T67<18,\"Junior\",IF(T67<21,\"Under 21\",IF(T67<40,\"Senior\",\"Veterans\"))))&\" Opens\")))","v":""},{"$f":"IF(F67>=14,IF(L67=\"Belt & Age\",IF(G67=\"black\",\"NO SUCH DIVISION!!!\",\"Development\"),\"\"),\"\")","v":""}]
["",{"$f":"IF(C68=\"\",\"\",IF(C68=C67,B67,IF(MATCH(C68,C$22:C$103,0)>=(ROW()-51),MAX(B$22:B67)+1,INDIRECT(\"b\"&(MATCH(C68,C$22:C$103,0)+51),1))))","v":""},null,null,null,"",null,{"$f":"IF(F68=\"\",\"\",IF(F68<=13,\"Children\",IF(F68<=15,\"Cadet\",IF(F68<=17,\"Junior\",\"Senior\"))))","v":""},"",null,null,null,null,null,"","",{"$f":"IF(C68=\"\",\"\",IF(J68=\"Team\",\"Team\",IF(COUNTIF($C$22:$C$103,C68)-COUNTIFS($C$22:$C$103,C68,$J$22:$J$103,\"Team\")>COUNTIF($C$22:$C68,C68)-COUNTIFS($C$22:$C68,C68,$J$22:$J68,\"Team\"),\"\",COUNTIF($C$22:$C$103,C68)-COUNTIFS($C$22:$C$103,C68,$J$22:$J$103,\"Team\"))))","v":""},"",null,"",{"$f":"IF(T68=\"\",IF(L68=\"Belt & age\",IF(V68=\"\",IF(E68=\"m\",\"Boys \"&VLOOKUP(G68,INFO!B$19:C$27,2,0),\"Girls \"&VLOOKUP(G68,INFO!B$47:C$55,2,0)),V68),IF(L68=\"weight\",\"\",V68)),IF(J68=\"Team\",W68,IF(T68<14,\"Children\",IF(T68<16,\"Cadet\",IF(T68<18,\"Junior\",IF(T68<21,\"Under 21\",IF(T68<40,\"Senior\",\"Veterans\"))))&\" Opens\")))","v":""},{"$f":"IF(F68>=14,IF(L68=\"Belt & Age\",IF(G68=\"black\",\"NO SUCH DIVISION!!!\",\"Development\"),\"\"),\"\")","v":""}]
["",{"$f":"IF(C69=\"\",\"\",IF(C69=C68,B68,IF(MATCH(C69,C$22:C$103,0)>=(ROW()-51),MAX(B$22:B68)+1,INDIRECT(\"b\"&(MATCH(C69,C$22:C$103,0)+51),1))))","v":""},null,null,null,"",null,{"$f":"IF(F69=\"\",\"\",IF(F69<=13,\"Children\",IF(F69<=15,\"Cadet\",IF(F69<=17,\"Junior\",\"Senior\"))))","v":""},"",null,null,null,null,null,"","",{"$f":"IF(C69=\"\",\"\",IF(J69=\"Team\",\"Team\",IF(COUNTIF($C$22:$C$103,C69)-COUNTIFS($C$22:$C$103,C69,$J$22:$J$103,\"Team\")>COUNTIF($C$22:$C69,C69)-COUNTIFS($C$22:$C69,C69,$J$22:$J69,\"Team\"),\"\",COUNTIF($C$22:$C$103,C69)-COUNTIFS($C$22:$C$103,C69,$J$22:$J$103,\"Team\"))))","v":""},"",null,"",{"$f":"IF(T69=\"\",IF(L69=\"Belt & age\",IF(V69=\"\",IF(E69=\"m\",\"Boys \"&VLOOKUP(G69,INFO!B$19:C$27,2,0),\"Girls \"&VLOOKUP(G69,INFO!B$47:C$55,2,0)),V69),IF(L69=\"weight\",\"\",V69)),IF(J69=\"Team\",W69,IF(T69<14,\"Children\",IF(T69<16,\"Cadet\",IF(T69<18,\"Junior\",IF(T69<21,\"Under 21\",IF(T69<40,\"Senior\",\"Veterans\"))))&\" Opens\")))","v":""},{"$f":"IF(F69>=14,IF(L69=\"Belt & Age\",IF(G69=\"black\",\"NO SUCH DIVISION!!!\",\"Development\"),\"\"),\"\")","v":""}]
["",{"$f":"IF(C70=\"\",\"\",IF(C70=C69,B69,IF(MATCH(C70,C$22:C$103,0)>=(ROW()-51),MAX(B$22:B69)+1,INDIRECT(\"b\"&(MATCH(C70,C$22:C$103,0)+51),1))))","v":""},null,null,null,"",null,{"$f":"IF(F70=\"\",\"\",IF(F70<=13,\"Children\",IF(F70<=15,\"Cadet\",IF(F70<=17,\"Junior\",\"Senior\"))))","v":""},"",null,null,null,null,null,"","",{"$f":"IF(C70=\"\",\"\",IF(J70=\"Team\",\"Team\",IF(COUNTIF($C$22:$C$103,C70)-COUNTIFS($C$22:$C$103,C70,$J$22:$J$103,\"Team\")>COUNTIF($C$22:$C70,C70)-COUNTIFS($C$22:$C70,C70,$J$22:$J70,\"Team\"),\"\",COUNTIF($C$22:$C$103,C70)-COUNTIFS($C$22:$C$103,C70,$J$22:$J$103,\"Team\"))))","v":""},"",null,"",{"$f":"IF(T70=\"\",IF(L70=\"Belt & age\",IF(V70=\"\",IF(E70=\"m\",\"Boys \"&VLOOKUP(G70,INFO!B$19:C$27,2,0),\"Girls \"&VLOOKUP(G70,INFO!B$47:C$55,2,0)),V70),IF(L70=\"weight\",\"\",V70)),IF(J70=\"Team\",W70,IF(T70<14,\"Children\",IF(T70<16,\"Cadet\",IF(T70<18,\"Junior\",IF(T70<21,\"Under 21\",IF(T70<40,\"Senior\",\"Veterans\"))))&\" Opens\")))","v":""},{"$f":"IF(F70>=14,IF(L70=\"Belt & Age\",IF(G70=\"black\",\"NO SUCH DIVISION!!!\",\"Development\"),\"\"),\"\")","v":""}]
["",{"$f":"IF(C71=\"\",\"\",IF(C71=C70,B70,IF(MATCH(C71,C$22:C$103,0)>=(ROW()-51),MAX(B$22:B70)+1,INDIRECT(\"b\"&(MATCH(C71,C$22:C$103,0)+51),1))))","v":""},null,null,null,"",null,{"$f":"IF(F71=\"\",\"\",IF(F71<=13,\"Children\",IF(F71<=15,\"Cadet\",IF(F71<=17,\"Junior\",\"Senior\"))))","v":""},"",null,null,null,null,null,"","",{"$f":"IF(C71=\"\",\"\",IF(J71=\"Team\",\"Team\",IF(COUNTIF($C$22:$C$103,C71)-COUNTIFS($C$22:$C$103,C71,$J$22:$J$103,\"Team\")>COUNTIF($C$22:$C71,C71)-COUNTIFS($C$22:$C71,C71,$J$22:$J71,\"Team\"),\"\",COUNTIF($C$22:$C$103,C71)-COUNTIFS($C$22:$C$103,C71,$J$22:$J$103,\"Team\"))))","v":""},"",null,"",{"$f":"IF(T71=\"\",IF(L71=\"Belt & age\",IF(V71=\"\",IF(E71=\"m\",\"Boys \"&VLOOKUP(G71,INFO!B$19:C$27,2,0),\"Girls \"&VLOOKUP(G71,INFO!B$47:C$55,2,0)),V71),IF(L71=\"weight\",\"\",V71)),IF(J71=\"Team\",W71,IF(T71<14,\"Children\",IF(T71<16,\"Cadet\",IF(T71<18,\"Junior\",IF(T71<21,\"Under 21\",IF(T71<40,\"Senior\",\"Veterans\"))))&\" Opens\")))","v":""},{"$f":"IF(F71>=14,IF(L71=\"Belt & Age\",IF(G71=\"black\",\"NO SUCH DIVISION!!!\",\"Development\"),\"\"),\"\")","v":""}]
["",{"$f":"IF(C72=\"\",\"\",IF(C72=C71,B71,IF(MATCH(C72,C$22:C$103,0)>=(ROW()-51),MAX(B$22:B71)+1,INDIRECT(\"b\"&(MATCH(C72,C$22:C$103,0)+51),1))))","v":""},null,null,null,"",null,{"$f":"IF(F72=\"\",\"\",IF(F72<=13,\"Children\",IF(F72<=15,\"Cadet\",IF(F72<=17,\"Junior\",\"Senior\"))))","v":""},"",null,null,null,null,null,"","",{"$f":"IF(C72=\"\",\"\",IF(J72=\"Team\",\"Team\",IF(COUNTIF($C$22:$C$103,C72)-COUNTIFS($C$22:$C$103,C72,$J$22:$J$103,\"Team\")>COUNTIF($C$22:$C72,C72)-COUNTIFS($C$22:$C72,C72,$J$22:$J72,\"Team\"),\"\",COUNTIF($C$22:$C$103,C72)-COUNTIFS($C$22:$C$103,C72,$J$22:$J$103,\"Team\"))))","v":""},"",null,"",{"$f":"IF(T72=\"\",IF(L72=\"Belt & age\",IF(V72=\"\",IF(E72=\"m\",\"Boys \"&VLOOKUP(G72,INFO!B$19:C$27,2,0),\"Girls \"&VLOOKUP(G72,INFO!B$47:C$55,2,0)),V72),IF(L72=\"weight\",\"\",V72)),IF(J72=\"Team\",W72,IF(T72<14,\"Children\",IF(T72<16,\"Cadet\",IF(T72<18,\"Junior\",IF(T72<21,\"Under 21\",IF(T72<40,\"Senior\",\"Veterans\"))))&\" Opens\")))","v":""},{"$f":"IF(F72>=14,IF(L72=\"Belt & Age\",IF(G72=\"black\",\"NO SUCH DIVISION!!!\",\"Development\"),\"\"),\"\")","v":""}]
["",{"$f":"IF(C73=\"\",\"\",IF(C73=C72,B72,IF(MATCH(C73,C$22:C$103,0)>=(ROW()-51),MAX(B$22:B72)+1,INDIRECT(\"b\"&(MATCH(C73,C$22:C$103,0)+51),1))))","v":""},null,null,null,"",null,{"$f":"IF(F73=\"\",\"\",IF(F73<=13,\"Children\",IF(F73<=15,\"Cadet\",IF(F73<=17,\"Junior\",\"Senior\"))))","v":""},"",null,null,null,null,null,"","",{"$f":"IF(C73=\"\",\"\",IF(J73=\"Team\",\"Team\",IF(COUNTIF($C$22:$C$103,C73)-COUNTIFS($C$22:$C$103,C73,$J$22:$J$103,\"Team\")>COUNTIF($C$22:$C73,C73)-COUNTIFS($C$22:$C73,C73,$J$22:$J73,\"Team\"),\"\",COUNTIF($C$22:$C$103,C73)-COUNTIFS($C$22:$C$103,C73,$J$22:$J$103,\"Team\"))))","v":""},"",null,"",{"$f":"IF(T73=\"\",IF(L73=\"Belt & age\",IF(V73=\"\",IF(E73=\"m\",\"Boys \"&VLOOKUP(G73,INFO!B$19:C$27,2,0),\"Girls \"&VLOOKUP(G73,INFO!B$47:C$55,2,0)),V73),IF(L73=\"weight\",\"\",V73)),IF(J73=\"Team\",W73,IF(T73<14,\"Children\",IF(T73<16,\"Cadet\",IF(T73<18,\"Junior\",IF(T73<21,\"Under 21\",IF(T73<40,\"Senior\",\"Veterans\"))))&\" Opens\")))","v":""},{"$f":"IF(F73>=14,IF(L73=\"Belt & Age\",IF(G73=\"black\",\"NO SUCH DIVISION!!!\",\"Development\"),\"\"),\"\")","v":""}]
["",{"$f":"IF(C74=\"\",\"\",IF(C74=C73,B73,IF(MATCH(C74,C$22:C$103,0)>=(ROW()-51),MAX(B$22:B73)+1,INDIRECT(\"b\"&(MATCH(C74,C$22:C$103,0)+51),1))))","v":""},null,null,null,"",null,{"$f":"IF(F74=\"\",\"\",IF(F74<=13,\"Children\",IF(F74<=15,\"Cadet\",IF(F74<=17,\"Junior\",\"Senior\"))))","v":""},"",null,null,null,null,null,"","",{"$f":"IF(C74=\"\",\"\",IF(J74=\"Team\",\"Team\",IF(COUNTIF($C$22:$C$103,C74)-COUNTIFS($C$22:$C$103,C74,$J$22:$J$103,\"Team\")>COUNTIF($C$22:$C74,C74)-COUNTIFS($C$22:$C74,C74,$J$22:$J74,\"Team\"),\"\",COUNTIF($C$22:$C$103,C74)-COUNTIFS($C$22:$C$103,C74,$J$22:$J$103,\"Team\"))))","v":""},"",null,"",{"$f":"IF(T74=\"\",IF(L74=\"Belt & age\",IF(V74=\"\",IF(E74=\"m\",\"Boys \"&VLOOKUP(G74,INFO!B$19:C$27,2,0),\"Girls \"&VLOOKUP(G74,INFO!B$47:C$55,2,0)),V74),IF(L74=\"weight\",\"\",V74)),IF(J74=\"Team\",W74,IF(T74<14,\"Children\",IF(T74<16,\"Cadet\",IF(T74<18,\"Junior\",IF(T74<21,\"Under 21\",IF(T74<40,\"Senior\",\"Veterans\"))))&\" Opens\")))","v":""},{"$f":"IF(F74>=14,IF(L74=\"Belt & Age\",IF(G74=\"black\",\"NO SUCH DIVISION!!!\",\"Development\"),\"\"),\"\")","v":""}]
["",{"$f":"IF(C75=\"\",\"\",IF(C75=C74,B74,IF(MATCH(C75,C$22:C$103,0)>=(ROW()-51),MAX(B$22:B74)+1,INDIRECT(\"b\"&(MATCH(C75,C$22:C$103,0)+51),1))))","v":""},null,null,null,"",null,{"$f":"IF(F75=\"\",\"\",IF(F75<=13,\"Children\",IF(F75<=15,\"Cadet\",IF(F75<=17,\"Junior\",\"Senior\"))))","v":""},"",null,null,null,null,null,"","",{"$f":"IF(C75=\"\",\"\",IF(J75=\"Team\",\"Team\",IF(COUNTIF($C$22:$C$103,C75)-COUNTIFS($C$22:$C$103,C75,$J$22:$J$103,\"Team\")>COUNTIF($C$22:$C75,C75)-COUNTIFS($C$22:$C75,C75,$J$22:$J75,\"Team\"),\"\",COUNTIF($C$22:$C$103,C75)-COUNTIFS($C$22:$C$103,C75,$J$22:$J$103,\"Team\"))))","v":""},"",null,"",{"$f":"IF(T75=\"\",IF(L75=\"Belt & age\",IF(V75=\"\",IF(E75=\"m\",\"Boys \"&VLOOKUP(G75,INFO!B$19:C$27,2,0),\"Girls \"&VLOOKUP(G75,INFO!B$47:C$55,2,0)),V75),IF(L75=\"weight\",\"\",V75)),IF(J75=\"Team\",W75,IF(T75<14,\"Children\",IF(T75<16,\"Cadet\",IF(T75<18,\"Junior\",IF(T75<21,\"Under 21\",IF(T75<40,\"Senior\",\"Veterans\"))))&\" Opens\")))","v":""},{"$f":"IF(F75>=14,IF(L75=\"Belt & Age\",IF(G75=\"black\",\"NO SUCH DIVISION!!!\",\"Development\"),\"\"),\"\")","v":""}]
["",{"$f":"IF(C76=\"\",\"\",IF(C76=C75,B75,IF(MATCH(C76,C$22:C$103,0)>=(ROW()-51),MAX(B$22:B75)+1,INDIRECT(\"b\"&(MATCH(C76,C$22:C$103,0)+51),1))))","v":""},null,null,null,"",null,{"$f":"IF(F76=\"\",\"\",IF(F76<=13,\"Children\",IF(F76<=15,\"Cadet\",IF(F76<=17,\"Junior\",\"Senior\"))))","v":""},"",null,null,null,null,null,"","",{"$f":"IF(C76=\"\",\"\",IF(J76=\"Team\",\"Team\",IF(COUNTIF($C$22:$C$103,C76)-COUNTIFS($C$22:$C$103,C76,$J$22:$J$103,\"Team\")>COUNTIF($C$22:$C76,C76)-COUNTIFS($C$22:$C76,C76,$J$22:$J76,\"Team\"),\"\",COUNTIF($C$22:$C$103,C76)-COUNTIFS($C$22:$C$103,C76,$J$22:$J$103,\"Team\"))))","v":""},"",null,"",{"$f":"IF(T76=\"\",IF(L76=\"Belt & age\",IF(V76=\"\",IF(E76=\"m\",\"Boys \"&VLOOKUP(G76,INFO!B$19:C$27,2,0),\"Girls \"&VLOOKUP(G76,INFO!B$47:C$55,2,0)),V76),IF(L76=\"weight\",\"\",V76)),IF(J76=\"Team\",W76,IF(T76<14,\"Children\",IF(T76<16,\"Cadet\",IF(T76<18,\"Junior\",IF(T76<21,\"Under 21\",IF(T76<40,\"Senior\",\"Veterans\"))))&\" Opens\")))","v":""},{"$f":"IF(F76>=14,IF(L76=\"Belt & Age\",IF(G76=\"black\",\"NO SUCH DIVISION!!!\",\"Development\"),\"\"),\"\")","v":""}]
["",{"$f":"IF(C77=\"\",\"\",IF(C77=C76,B76,IF(MATCH(C77,C$22:C$103,0)>=(ROW()-51),MAX(B$22:B76)+1,INDIRECT(\"b\"&(MATCH(C77,C$22:C$103,0)+51),1))))","v":""},null,null,null,"",null,{"$f":"IF(F77=\"\",\"\",IF(F77<=13,\"Children\",IF(F77<=15,\"Cadet\",IF(F77<=17,\"Junior\",\"Senior\"))))","v":""},"",null,null,null,null,null,"","",{"$f":"IF(C77=\"\",\"\",IF(J77=\"Team\",\"Team\",IF(COUNTIF($C$22:$C$103,C77)-COUNTIFS($C$22:$C$103,C77,$J$22:$J$103,\"Team\")>COUNTIF($C$22:$C77,C77)-COUNTIFS($C$22:$C77,C77,$J$22:$J77,\"Team\"),\"\",COUNTIF($C$22:$C$103,C77)-COUNTIFS($C$22:$C$103,C77,$J$22:$J$103,\"Team\"))))","v":""},"",null,"",{"$f":"IF(T77=\"\",IF(L77=\"Belt & age\",IF(V77=\"\",IF(E77=\"m\",\"Boys \"&VLOOKUP(G77,INFO!B$19:C$27,2,0),\"Girls \"&VLOOKUP(G77,INFO!B$47:C$55,2,0)),V77),IF(L77=\"weight\",\"\",V77)),IF(J77=\"Team\",W77,IF(T77<14,\"Children\",IF(T77<16,\"Cadet\",IF(T77<18,\"Junior\",IF(T77<21,\"Under 21\",IF(T77<40,\"Senior\",\"Veterans\"))))&\" Opens\")))","v":""},{"$f":"IF(F77>=14,IF(L77=\"Belt & Age\",IF(G77=\"black\",\"NO SUCH DIVISION!!!\",\"Development\"),\"\"),\"\")","v":""}]
["",{"$f":"IF(C78=\"\",\"\",IF(C78=C77,B77,IF(MATCH(C78,C$22:C$103,0)>=(ROW()-51),MAX(B$22:B77)+1,INDIRECT(\"b\"&(MATCH(C78,C$22:C$103,0)+51),1))))","v":""},null,null,null,"",null,{"$f":"IF(F78=\"\",\"\",IF(F78<=13,\"Children\",IF(F78<=15,\"Cadet\",IF(F78<=17,\"Junior\",\"Senior\"))))","v":""},"",null,null,null,null,null,"","",{"$f":"IF(C78=\"\",\"\",IF(J78=\"Team\",\"Team\",IF(COUNTIF($C$22:$C$103,C78)-COUNTIFS($C$22:$C$103,C78,$J$22:$J$103,\"Team\")>COUNTIF($C$22:$C78,C78)-COUNTIFS($C$22:$C78,C78,$J$22:$J78,\"Team\"),\"\",COUNTIF($C$22:$C$103,C78)-COUNTIFS($C$22:$C$103,C78,$J$22:$J$103,\"Team\"))))","v":""},"",null,"",{"$f":"IF(T78=\"\",IF(L78=\"Belt & age\",IF(V78=\"\",IF(E78=\"m\",\"Boys \"&VLOOKUP(G78,INFO!B$19:C$27,2,0),\"Girls \"&VLOOKUP(G78,INFO!B$47:C$55,2,0)),V78),IF(L78=\"weight\",\"\",V78)),IF(J78=\"Team\",W78,IF(T78<14,\"Children\",IF(T78<16,\"Cadet\",IF(T78<18,\"Junior\",IF(T78<21,\"Under 21\",IF(T78<40,\"Senior\",\"Veterans\"))))&\" Opens\")))","v":""},{"$f":"IF(F78>=14,IF(L78=\"Belt & Age\",IF(G78=\"black\",\"NO SUCH DIVISION!!!\",\"Development\"),\"\"),\"\")","v":""}]
["",{"$f":"IF(C79=\"\",\"\",IF(C79=C78,B78,IF(MATCH(C79,C$22:C$103,0)>=(ROW()-51),MAX(B$22:B78)+1,INDIRECT(\"b\"&(MATCH(C79,C$22:C$103,0)+51),1))))","v":""},null,null,null,"",null,{"$f":"IF(F79=\"\",\"\",IF(F79<=13,\"Children\",IF(F79<=15,\"Cadet\",IF(F79<=17,\"Junior\",\"Senior\"))))","v":""},"",null,null,null,null,null,"","",{"$f":"IF(C79=\"\",\"\",IF(J79=\"Team\",\"Team\",IF(COUNTIF($C$22:$C$103,C79)-COUNTIFS($C$22:$C$103,C79,$J$22:$J$103,\"Team\")>COUNTIF($C$22:$C79,C79)-COUNTIFS($C$22:$C79,C79,$J$22:$J79,\"Team\"),\"\",COUNTIF($C$22:$C$103,C79)-COUNTIFS($C$22:$C$103,C79,$J$22:$J$103,\"Team\"))))","v":""},"",null,"",{"$f":"IF(T79=\"\",IF(L79=\"Belt & age\",IF(V79=\"\",IF(E79=\"m\",\"Boys \"&VLOOKUP(G79,INFO!B$19:C$27,2,0),\"Girls \"&VLOOKUP(G79,INFO!B$47:C$55,2,0)),V79),IF(L79=\"weight\",\"\",V79)),IF(J79=\"Team\",W79,IF(T79<14,\"Children\",IF(T79<16,\"Cadet\",IF(T79<18,\"Junior\",IF(T79<21,\"Under 21\",IF(T79<40,\"Senior\",\"Veterans\"))))&\" Opens\")))","v":""},{"$f":"IF(F79>=14,IF(L79=\"Belt & Age\",IF(G79=\"black\",\"NO SUCH DIVISION!!!\",\"Development\"),\"\"),\"\")","v":""}]
["",{"$f":"IF(C80=\"\",\"\",IF(C80=C79,B79,IF(MATCH(C80,C$22:C$103,0)>=(ROW()-51),MAX(B$22:B79)+1,INDIRECT(\"b\"&(MATCH(C80,C$22:C$103,0)+51),1))))","v":""},null,null,null,{"$f":"IF(D80=\"\",\"\",IF(MONTH($Q$1)>=MONTH(D80),IF(MONTH($Q$1)=MONTH(D80),IF(DAY($Q$1)>=DAY(D80),YEAR($Q$1)-YEAR(D80),YEAR($Q$1)-YEAR(D80)-1),YEAR($Q$1)-YEAR(D80)),YEAR($Q$1)-YEAR(D80)-1))","v":""},null,{"$f":"IF(F80=\"\",\"\",IF(F80<=13,\"Children\",IF(F80<=15,\"Cadet\",IF(F80<=17,\"Junior\",\"Senior\"))))","v":""},"",null,null,null,null,null,"","",{"$f":"IF(C80=\"\",\"\",IF(J80=\"Team\",\"Team\",IF(COUNTIF($C$22:$C$103,C80)-COUNTIFS($C$22:$C$103,C80,$J$22:$J$103,\"Team\")>COUNTIF($C$22:$C80,C80)-COUNTIFS($C$22:$C80,C80,$J$22:$J80,\"Team\"),\"\",COUNTIF($C$22:$C$103,C80)-COUNTIFS($C$22:$C$103,C80,$J$22:$J$103,\"Team\"))))","v":""},"",null,{"$f":"IF(L80=\"Open *\",IF(D80=\"\",\"\",IF(MONTH($Q$2)>=MONTH(D80),IF(MONTH($Q$2)=MONTH(D80),IF(DAY($Q$2)>=DAY(D80),YEAR($Q$2)-YEAR(D80),YEAR($Q$2)-YEAR(D80)-1),YEAR($Q$2)-YEAR(D80)),YEAR($Q$2)-YEAR(D80)-1)),\"\")","v":""},{"$f":"IF(T80=\"\",IF(L80=\"Belt & age\",IF(V80=\"\",IF(E80=\"m\",\"Boys \"&VLOOKUP(G80,INFO!B$19:C$27,2,0),\"Girls \"&VLOOKUP(G80,INFO!B$47:C$55,2,0)),V80),IF(L80=\"weight\",\"\",V80)),IF(J80=\"Team\",W80,IF(T80<14,\"Children\",IF(T80<16,\"Cadet\",IF(T80<18,\"Junior\",IF(T80<21,\"Under 21\",IF(T80<40,\"Senior\",\"Veterans\"))))&\" Opens\")))","v":""},{"$f":"IF(F80>=14,IF(L80=\"Belt & Age\",IF(G80=\"black\",\"NO SUCH DIVISION!!!\",\"Development\"),\"\"),\"\")","v":""}]
["",{"$f":"IF(C81=\"\",\"\",IF(C81=C80,B80,IF(MATCH(C81,C$22:C$103,0)>=(ROW()-51),MAX(B$22:B80)+1,INDIRECT(\"b\"&(MATCH(C81,C$22:C$103,0)+51),1))))","v":""},null,null,null,"",null,{"$f":"IF(F81=\"\",\"\",IF(F81<=13,\"Children\",IF(F81<=15,\"Cadet\",IF(F81<=17,\"Junior\",\"Senior\"))))","v":""},"",null,null,null,null,null,{"$f":"IF(J81=\"Individual\",IF(K81=\"Kata\",\"X\",IF(K81=\"Superkata\",\"S\",\"\")),IF(K81=\"kata\",\"T\",\"\"))","v":""},{"$f":"IF(J81=\"Individual\",IF(K81=\"Kumite\",\"X\",\"\"),IF(K81=\"kumite\",\"T\",\"\"))","v":""},{"$f":"IF(C81=\"\",\"\",IF(J81=\"Team\",\"Team\",IF(COUNTIF($C$22:$C$103,C81)-COUNTIFS($C$22:$C$103,C81,$J$22:$J$103,\"Team\")>COUNTIF($C$22:$C81,C81)-COUNTIFS($C$22:$C81,C81,$J$22:$J81,\"Team\"),\"\",COUNTIF($C$22:$C$103,C81)-COUNTIFS($C$22:$C$103,C81,$J$22:$J$103,\"Team\"))))","v":""},"",null,"",{"$f":"IF(T81=\"\",IF(L81=\"Belt & age\",IF(V81=\"\",IF(E81=\"m\",\"Boys \"&VLOOKUP(G81,INFO!B$19:C$27,2,0),\"Girls \"&VLOOKUP(G81,INFO!B$47:C$55,2,0)),V81),IF(L81=\"weight\",\"\",V81)),IF(J81=\"Team\",W81,IF(T81<14,\"Children\",IF(T81<16,\"Cadet\",IF(T81<18,\"Junior\",IF(T81<21,\"Under 21\",IF(T81<40,\"Senior\",\"Veterans\"))))&\" Opens\")))","v":""},{"$f":"IF(F81>=14,IF(L81=\"Belt & Age\",IF(G81=\"black\",\"NO SUCH DIVISION!!!\",\"Development\"),\"\"),\"\")","v":""}]
["",{"$f":"IF(C82=\"\",\"\",IF(C82=C81,B81,IF(MATCH(C82,C$22:C$103,0)>=(ROW()-51),MAX(B$22:B81)+1,INDIRECT(\"b\"&(MATCH(C82,C$22:C$103,0)+51),1))))","v":""},null,null,null,"",null,{"$f":"IF(F82=\"\",\"\",IF(F82<=13,\"Children\",IF(F82<=15,\"Cadet\",IF(F82<=17,\"Junior\",\"Senior\"))))","v":""},"",null,null,null,null,null,"","",{"$f":"IF(C82=\"\",\"\",IF(J82=\"Team\",\"Team\",IF(COUNTIF($C$22:$C$103,C82)-COUNTIFS($C$22:$C$103,C82,$J$22:$J$103,\"Team\")>COUNTIF($C$22:$C82,C82)-COUNTIFS($C$22:$C82,C82,$J$22:$J82,\"Team\"),\"\",COUNTIF($C$22:$C$103,C82)-COUNTIFS($C$22:$C$103,C82,$J$22:$J$103,\"Team\"))))","v":""},"",null,"",{"$f":"IF(T82=\"\",IF(L82=\"Belt & age\",IF(V82=\"\",IF(E82=\"m\",\"Boys \"&VLOOKUP(G82,INFO!B$19:C$27,2,0),\"Girls \"&VLOOKUP(G82,INFO!B$47:C$55,2,0)),V82),IF(L82=\"weight\",\"\",V82)),IF(J82=\"Team\",W82,IF(T82<14,\"Children\",IF(T82<16,\"Cadet\",IF(T82<18,\"Junior\",IF(T82<21,\"Under 21\",IF(T82<40,\"Senior\",\"Veterans\"))))&\" Opens\")))","v":""},{"$f":"IF(F82>=14,IF(L82=\"Belt & Age\",IF(G82=\"black\",\"NO SUCH DIVISION!!!\",\"Development\"),\"\"),\"\")","v":""}]
["",{"$f":"IF(C83=\"\",\"\",IF(C83=C82,B82,IF(MATCH(C83,C$22:C$103,0)>=(ROW()-51),MAX(B$22:B82)+1,INDIRECT(\"b\"&(MATCH(C83,C$22:C$103,0)+51),1))))","v":""},null,null,null,"",null,{"$f":"IF(F83=\"\",\"\",IF(F83<=13,\"Children\",IF(F83<=15,\"Cadet\",IF(F83<=17,\"Junior\",\"Senior\"))))","v":""},"",null,null,null,null,null,"","",{"$f":"IF(C83=\"\",\"\",IF(J83=\"Team\",\"Team\",IF(COUNTIF($C$22:$C$103,C83)-COUNTIFS($C$22:$C$103,C83,$J$22:$J$103,\"Team\")>COUNTIF($C$22:$C83,C83)-COUNTIFS($C$22:$C83,C83,$J$22:$J83,\"Team\"),\"\",COUNTIF($C$22:$C$103,C83)-COUNTIFS($C$22:$C$103,C83,$J$22:$J$103,\"Team\"))))","v":""},"",null,"",{"$f":"IF(T83=\"\",IF(L83=\"Belt & age\",IF(V83=\"\",IF(E83=\"m\",\"Boys \"&VLOOKUP(G83,INFO!B$19:C$27,2,0),\"Girls \"&VLOOKUP(G83,INFO!B$47:C$55,2,0)),V83),IF(L83=\"weight\",\"\",V83)),IF(J83=\"Team\",W83,IF(T83<14,\"Children\",IF(T83<16,\"Cadet\",IF(T83<18,\"Junior\",IF(T83<21,\"Under 21\",IF(T83<40,\"Senior\",\"Veterans\"))))&\" Opens\")))","v":""},{"$f":"IF(F83>=14,IF(L83=\"Belt & Age\",IF(G83=\"black\",\"NO SUCH DIVISION!!!\",\"Development\"),\"\"),\"\")","v":""}]
["",{"$f":"IF(C84=\"\",\"\",IF(C84=C83,B83,IF(MATCH(C84,C$22:C$103,0)>=(ROW()-51),MAX(B$22:B83)+1,INDIRECT(\"b\"&(MATCH(C84,C$22:C$103,0)+51),1))))","v":""},null,null,null,"",null,{"$f":"IF(F84=\"\",\"\",IF(F84<=13,\"Children\",IF(F84<=15,\"Cadet\",IF(F84<=17,\"Junior\",\"Senior\"))))","v":""},"",null,null,null,null,null,"","",{"$f":"IF(C84=\"\",\"\",IF(J84=\"Team\",\"Team\",IF(COUNTIF($C$22:$C$103,C84)-COUNTIFS($C$22:$C$103,C84,$J$22:$J$103,\"Team\")>COUNTIF($C$22:$C84,C84)-COUNTIFS($C$22:$C84,C84,$J$22:$J84,\"Team\"),\"\",COUNTIF($C$22:$C$103,C84)-COUNTIFS($C$22:$C$103,C84,$J$22:$J$103,\"Team\"))))","v":""},"",null,"",{"$f":"IF(T84=\"\",IF(L84=\"Belt & age\",IF(V84=\"\",IF(E84=\"m\",\"Boys \"&VLOOKUP(G84,INFO!B$19:C$27,2,0),\"Girls \"&VLOOKUP(G84,INFO!B$47:C$55,2,0)),V84),IF(L84=\"weight\",\"\",V84)),IF(J84=\"Team\",W84,IF(T84<14,\"Children\",IF(T84<16,\"Cadet\",IF(T84<18,\"Junior\",IF(T84<21,\"Under 21\",IF(T84<40,\"Senior\",\"Veterans\"))))&\" Opens\")))","v":""},{"$f":"IF(F84>=14,IF(L84=\"Belt & Age\",IF(G84=\"black\",\"NO SUCH DIVISION!!!\",\"Development\"),\"\"),\"\")","v":""}]
["",{"$f":"IF(C85=\"\",\"\",IF(C85=C84,B84,IF(MATCH(C85,C$22:C$103,0)>=(ROW()-51),MAX(B$22:B84)+1,INDIRECT(\"b\"&(MATCH(C85,C$22:C$103,0)+51),1))))","v":""},null,null,null,"",null,{"$f":"IF(F85=\"\",\"\",IF(F85<=13,\"Children\",IF(F85<=15,\"Cadet\",IF(F85<=17,\"Junior\",\"Senior\"))))","v":""},"",null,null,null,null,null,"","",{"$f":"IF(C85=\"\",\"\",IF(J85=\"Team\",\"Team\",IF(COUNTIF($C$22:$C$103,C85)-COUNTIFS($C$22:$C$103,C85,$J$22:$J$103,\"Team\")>COUNTIF($C$22:$C85,C85)-COUNTIFS($C$22:$C85,C85,$J$22:$J85,\"Team\"),\"\",COUNTIF($C$22:$C$103,C85)-COUNTIFS($C$22:$C$103,C85,$J$22:$J$103,\"Team\"))))","v":""},"",null,"",{"$f":"IF(T85=\"\",IF(L85=\"Belt & age\",IF(V85=\"\",IF(E85=\"m\",\"Boys \"&VLOOKUP(G85,INFO!B$19:C$27,2,0),\"Girls \"&VLOOKUP(G85,INFO!B$47:C$55,2,0)),V85),IF(L85=\"weight\",\"\",V85)),IF(J85=\"Team\",W85,IF(T85<14,\"Children\",IF(T85<16,\"Cadet\",IF(T85<18,\"Junior\",IF(T85<21,\"Under 21\",IF(T85<40,\"Senior\",\"Veterans\"))))&\" Opens\")))","v":""},{"$f":"IF(F85>=14,IF(L85=\"Belt & Age\",IF(G85=\"black\",\"NO SUCH DIVISION!!!\",\"Development\"),\"\"),\"\")","v":""}]
["",{"$f":"IF(C86=\"\",\"\",IF(C86=C85,B85,IF(MATCH(C86,C$22:C$103,0)>=(ROW()-51),MAX(B$22:B85)+1,INDIRECT(\"b\"&(MATCH(C86,C$22:C$103,0)+51),1))))","v":""},null,null,null,"",null,{"$f":"IF(F86=\"\",\"\",IF(F86<=13,\"Children\",IF(F86<=15,\"Cadet\",IF(F86<=17,\"Junior\",\"Senior\"))))","v":""},"",null,null,null,null,null,"","",{"$f":"IF(C86=\"\",\"\",IF(J86=\"Team\",\"Team\",IF(COUNTIF($C$22:$C$103,C86)-COUNTIFS($C$22:$C$103,C86,$J$22:$J$103,\"Team\")>COUNTIF($C$22:$C86,C86)-COUNTIFS($C$22:$C86,C86,$J$22:$J86,\"Team\"),\"\",COUNTIF($C$22:$C$103,C86)-COUNTIFS($C$22:$C$103,C86,$J$22:$J$103,\"Team\"))))","v":""},{"$f":"IF(Q86=\"\",\"\",IF(Q86=1,150,IF(Q86=2,250,IF(Q86=3,350,IF(Q86=\"team\",210/3,400)))))","v":""},null,"",{"$f":"IF(T86=\"\",IF(L86=\"Belt & age\",IF(V86=\"\",IF(E86=\"m\",\"Boys \"&VLOOKUP(G86,INFO!B$19:C$27,2,0),\"Girls \"&VLOOKUP(G86,INFO!B$47:C$55,2,0)),V86),IF(L86=\"weight\",\"\",V86)),IF(J86=\"Team\",W86,IF(T86<14,\"Children\",IF(T86<16,\"Cadet\",IF(T86<18,\"Junior\",IF(T86<21,\"Under 21\",IF(T86<40,\"Senior\",\"Veterans\"))))&\" Opens\")))","v":""},{"$f":"IF(F86>=14,IF(L86=\"Belt & Age\",IF(G86=\"black\",\"NO SUCH DIVISION!!!\",\"Development\"),\"\"),\"\")","v":""}]
["",{"$f":"IF(C87=\"\",\"\",IF(C87=C86,B86,IF(MATCH(C87,C$22:C$103,0)>=(ROW()-51),MAX(B$22:B86)+1,INDIRECT(\"b\"&(MATCH(C87,C$22:C$103,0)+51),1))))","v":""},null,null,null,"",null,{"$f":"IF(F87=\"\",\"\",IF(F87<=13,\"Children\",IF(F87<=15,\"Cadet\",IF(F87<=17,\"Junior\",\"Senior\"))))","v":""},"",null,null,null,null,null,"","",{"$f":"IF(C87=\"\",\"\",IF(J87=\"Team\",\"Team\",IF(COUNTIF($C$22:$C$103,C87)-COUNTIFS($C$22:$C$103,C87,$J$22:$J$103,\"Team\")>COUNTIF($C$22:$C87,C87)-COUNTIFS($C$22:$C87,C87,$J$22:$J87,\"Team\"),\"\",COUNTIF($C$22:$C$103,C87)-COUNTIFS($C$22:$C$103,C87,$J$22:$J$103,\"Team\"))))","v":""},"",null,"",{"$f":"IF(T87=\"\",IF(L87=\"Belt & age\",IF(V87=\"\",IF(E87=\"m\",\"Boys \"&VLOOKUP(G87,INFO!B$19:C$27,2,0),\"Girls \"&VLOOKUP(G87,INFO!B$47:C$55,2,0)),V87),IF(L87=\"weight\",\"\",V87)),IF(J87=\"Team\",W87,IF(T87<14,\"Children\",IF(T87<16,\"Cadet\",IF(T87<18,\"Junior\",IF(T87<21,\"Under 21\",IF(T87<40,\"Senior\",\"Veterans\"))))&\" Opens\")))","v":""},{"$f":"IF(F87>=14,IF(L87=\"Belt & Age\",IF(G87=\"black\",\"NO SUCH DIVISION!!!\",\"Development\"),\"\"),\"\")","v":""}]
["",{"$f":"IF(C88=\"\",\"\",IF(C88=C87,B87,IF(MATCH(C88,C$22:C$103,0)>=(ROW()-51),MAX(B$22:B87)+1,INDIRECT(\"b\"&(MATCH(C88,C$22:C$103,0)+51),1))))","v":""},null,null,null,"",null,{"$f":"IF(F88=\"\",\"\",IF(F88<=13,\"Children\",IF(F88<=15,\"Cadet\",IF(F88<=17,\"Junior\",\"Senior\"))))","v":""},{"$f":"IF(C88=\"\",\"\",+$D$2)","v":""},null,null,null,null,null,"","",{"$f":"IF(C88=\"\",\"\",IF(J88=\"Team\",\"Team\",IF(COUNTIF($C$22:$C$103,C88)-COUNTIFS($C$22:$C$103,C88,$J$22:$J$103,\"Team\")>COUNTIF($C$22:$C88,C88)-COUNTIFS($C$22:$C88,C88,$J$22:$J88,\"Team\"),\"\",COUNTIF($C$22:$C$103,C88)-COUNTIFS($C$22:$C$103,C88,$J$22:$J$103,\"Team\"))))","v":""},"",null,"",{"$f":"IF(T88=\"\",IF(L88=\"Belt & age\",IF(V88=\"\",IF(E88=\"m\",\"Boys \"&VLOOKUP(G88,INFO!B$19:C$27,2,0),\"Girls \"&VLOOKUP(G88,INFO!B$47:C$55,2,0)),V88),IF(L88=\"weight\",\"\",V88)),IF(J88=\"Team\",W88,IF(T88<14,\"Children\",IF(T88<16,\"Cadet\",IF(T88<18,\"Junior\",IF(T88<21,\"Under 21\",IF(T88<40,\"Senior\",\"Veterans\"))))&\" Opens\")))","v":""},{"$f":"IF(F88>=14,IF(L88=\"Belt & Age\",IF(G88=\"black\",\"NO SUCH DIVISION!!!\",\"Development\"),\"\"),\"\")","v":""}]
["",{"$f":"IF(C89=\"\",\"\",IF(C89=C88,B88,IF(MATCH(C89,C$22:C$103,0)>=(ROW()-51),MAX(B$22:B88)+1,INDIRECT(\"b\"&(MATCH(C89,C$22:C$103,0)+51),1))))","v":""},null,null,null,"",null,{"$f":"IF(F89=\"\",\"\",IF(F89<=13,\"Children\",IF(F89<=15,\"Cadet\",IF(F89<=17,\"Junior\",\"Senior\"))))","v":""},"",null,null,null,null,null,"","",{"$f":"IF(C89=\"\",\"\",IF(J89=\"Team\",\"Team\",IF(COUNTIF($C$22:$C$103,C89)-COUNTIFS($C$22:$C$103,C89,$J$22:$J$103,\"Team\")>COUNTIF($C$22:$C89,C89)-COUNTIFS($C$22:$C89,C89,$J$22:$J89,\"Team\"),\"\",COUNTIF($C$22:$C$103,C89)-COUNTIFS($C$22:$C$103,C89,$J$22:$J$103,\"Team\"))))","v":""},"",null,"",{"$f":"IF(T89=\"\",IF(L89=\"Belt & age\",IF(V89=\"\",IF(E89=\"m\",\"Boys \"&VLOOKUP(G89,INFO!B$19:C$27,2,0),\"Girls \"&VLOOKUP(G89,INFO!B$47:C$55,2,0)),V89),IF(L89=\"weight\",\"\",V89)),IF(J89=\"Team\",W89,IF(T89<14,\"Children\",IF(T89<16,\"Cadet\",IF(T89<18,\"Junior\",IF(T89<21,\"Under 21\",IF(T89<40,\"Senior\",\"Veterans\"))))&\" Opens\")))","v":""},{"$f":"IF(F89>=14,IF(L89=\"Belt & Age\",IF(G89=\"black\",\"NO SUCH DIVISION!!!\",\"Development\"),\"\"),\"\")","v":""}]
["",{"$f":"IF(C90=\"\",\"\",IF(C90=C89,B89,IF(MATCH(C90,C$22:C$103,0)>=(ROW()-51),MAX(B$22:B89)+1,INDIRECT(\"b\"&(MATCH(C90,C$22:C$103,0)+51),1))))","v":""},null,null,null,"",null,{"$f":"IF(F90=\"\",\"\",IF(F90<=13,\"Children\",IF(F90<=15,\"Cadet\",IF(F90<=17,\"Junior\",\"Senior\"))))","v":""},"",null,null,null,null,null,"","",{"$f":"IF(C90=\"\",\"\",IF(J90=\"Team\",\"Team\",IF(COUNTIF($C$22:$C$103,C90)-COUNTIFS($C$22:$C$103,C90,$J$22:$J$103,\"Team\")>COUNTIF($C$22:$C90,C90)-COUNTIFS($C$22:$C90,C90,$J$22:$J90,\"Team\"),\"\",COUNTIF($C$22:$C$103,C90)-COUNTIFS($C$22:$C$103,C90,$J$22:$J$103,\"Team\"))))","v":""},"",null,"",{"$f":"IF(T90=\"\",IF(L90=\"Belt & age\",IF(V90=\"\",IF(E90=\"m\",\"Boys \"&VLOOKUP(G90,INFO!B$19:C$27,2,0),\"Girls \"&VLOOKUP(G90,INFO!B$47:C$55,2,0)),V90),IF(L90=\"weight\",\"\",V90)),IF(J90=\"Team\",W90,IF(T90<14,\"Children\",IF(T90<16,\"Cadet\",IF(T90<18,\"Junior\",IF(T90<21,\"Under 21\",IF(T90<40,\"Senior\",\"Veterans\"))))&\" Opens\")))","v":""},{"$f":"IF(F90>=14,IF(L90=\"Belt & Age\",IF(G90=\"black\",\"NO SUCH DIVISION!!!\",\"Development\"),\"\"),\"\")","v":""}]
["",{"$f":"IF(C91=\"\",\"\",IF(C91=C90,B90,IF(MATCH(C91,C$22:C$103,0)>=(ROW()-51),MAX(B$22:B90)+1,INDIRECT(\"b\"&(MATCH(C91,C$22:C$103,0)+51),1))))","v":""},null,null,null,"",null,{"$f":"IF(F91=\"\",\"\",IF(F91<=13,\"Children\",IF(F91<=15,\"Cadet\",IF(F91<=17,\"Junior\",\"Senior\"))))","v":""},"",null,null,null,null,null,"","",{"$f":"IF(C91=\"\",\"\",IF(J91=\"Team\",\"Team\",IF(COUNTIF($C$22:$C$103,C91)-COUNTIFS($C$22:$C$103,C91,$J$22:$J$103,\"Team\")>COUNTIF($C$22:$C91,C91)-COUNTIFS($C$22:$C91,C91,$J$22:$J91,\"Team\"),\"\",COUNTIF($C$22:$C$103,C91)-COUNTIFS($C$22:$C$103,C91,$J$22:$J$103,\"Team\"))))","v":""},"",null,"",{"$f":"IF(T91=\"\",IF(L91=\"Belt & age\",IF(V91=\"\",IF(E91=\"m\",\"Boys \"&VLOOKUP(G91,INFO!B$19:C$27,2,0),\"Girls \"&VLOOKUP(G91,INFO!B$47:C$55,2,0)),V91),IF(L91=\"weight\",\"\",V91)),IF(J91=\"Team\",W91,IF(T91<14,\"Children\",IF(T91<16,\"Cadet\",IF(T91<18,\"Junior\",IF(T91<21,\"Under 21\",IF(T91<40,\"Senior\",\"Veterans\"))))&\" Opens\")))","v":""},{"$f":"IF(F91>=14,IF(L91=\"Belt & Age\",IF(G91=\"black\",\"NO SUCH DIVISION!!!\",\"Development\"),\"\"),\"\")","v":""}]
["",{"$f":"IF(C92=\"\",\"\",IF(C92=C91,B91,IF(MATCH(C92,C$22:C$103,0)>=(ROW()-51),MAX(B$22:B91)+1,INDIRECT(\"b\"&(MATCH(C92,C$22:C$103,0)+51),1))))","v":""},null,null,null,"",null,{"$f":"IF(F92=\"\",\"\",IF(F92<=13,\"Children\",IF(F92<=15,\"Cadet\",IF(F92<=17,\"Junior\",\"Senior\"))))","v":""},"",null,null,null,null,null,"","",{"$f":"IF(C92=\"\",\"\",IF(J92=\"Team\",\"Team\",IF(COUNTIF($C$22:$C$103,C92)-COUNTIFS($C$22:$C$103,C92,$J$22:$J$103,\"Team\")>COUNTIF($C$22:$C92,C92)-COUNTIFS($C$22:$C92,C92,$J$22:$J92,\"Team\"),\"\",COUNTIF($C$22:$C$103,C92)-COUNTIFS($C$22:$C$103,C92,$J$22:$J$103,\"Team\"))))","v":""},"",null,"",{"$f":"IF(T92=\"\",IF(L92=\"Belt & age\",IF(V92=\"\",IF(E92=\"m\",\"Boys \"&VLOOKUP(G92,INFO!B$19:C$27,2,0),\"Girls \"&VLOOKUP(G92,INFO!B$47:C$55,2,0)),V92),IF(L92=\"weight\",\"\",V92)),IF(J92=\"Team\",W92,IF(T92<14,\"Children\",IF(T92<16,\"Cadet\",IF(T92<18,\"Junior\",IF(T92<21,\"Under 21\",IF(T92<40,\"Senior\",\"Veterans\"))))&\" Opens\")))","v":""},{"$f":"IF(F92>=14,IF(L92=\"Belt & Age\",IF(G92=\"black\",\"NO SUCH DIVISION!!!\",\"Development\"),\"\"),\"\")","v":""}]
["",{"$f":"IF(C93=\"\",\"\",IF(C93=C92,B92,IF(MATCH(C93,C$22:C$103,0)>=(ROW()-51),MAX(B$22:B92)+1,INDIRECT(\"b\"&(MATCH(C93,C$22:C$103,0)+51),1))))","v":""},null,null,null,"",null,{"$f":"IF(F93=\"\",\"\",IF(F93<=13,\"Children\",IF(F93<=15,\"Cadet\",IF(F93<=17,\"Junior\",\"Senior\"))))","v":""},"",null,null,null,null,null,"","",{"$f":"IF(C93=\"\",\"\",IF(J93=\"Team\",\"Team\",IF(COUNTIF($C$22:$C$103,C93)-COUNTIFS($C$22:$C$103,C93,$J$22:$J$103,\"Team\")>COUNTIF($C$22:$C93,C93)-COUNTIFS($C$22:$C93,C93,$J$22:$J93,\"Team\"),\"\",COUNTIF($C$22:$C$103,C93)-COUNTIFS($C$22:$C$103,C93,$J$22:$J$103,\"Team\"))))","v":""},"",null,"",{"$f":"IF(T93=\"\",IF(L93=\"Belt & age\",IF(V93=\"\",IF(E93=\"m\",\"Boys \"&VLOOKUP(G93,INFO!B$19:C$27,2,0),\"Girls \"&VLOOKUP(G93,INFO!B$47:C$55,2,0)),V93),IF(L93=\"weight\",\"\",V93)),IF(J93=\"Team\",W93,IF(T93<14,\"Children\",IF(T93<16,\"Cadet\",IF(T93<18,\"Junior\",IF(T93<21,\"Under 21\",IF(T93<40,\"Senior\",\"Veterans\"))))&\" Opens\")))","v":""},{"$f":"IF(F93>=14,IF(L93=\"Belt & Age\",IF(G93=\"black\",\"NO SUCH DIVISION!!!\",\"Development\"),\"\"),\"\")","v":""}]
["",{"$f":"IF(C94=\"\",\"\",IF(C94=C93,B93,IF(MATCH(C94,C$22:C$103,0)>=(ROW()-51),MAX(B$22:B93)+1,INDIRECT(\"b\"&(MATCH(C94,C$22:C$103,0)+51),1))))","v":""},null,null,null,"",null,{"$f":"IF(F94=\"\",\"\",IF(F94<=13,\"Children\",IF(F94<=15,\"Cadet\",IF(F94<=17,\"Junior\",\"Senior\"))))","v":""},"",null,null,null,null,null,"","",{"$f":"IF(C94=\"\",\"\",IF(J94=\"Team\",\"Team\",IF(COUNTIF($C$22:$C$103,C94)-COUNTIFS($C$22:$C$103,C94,$J$22:$J$103,\"Team\")>COUNTIF($C$22:$C94,C94)-COUNTIFS($C$22:$C94,C94,$J$22:$J94,\"Team\"),\"\",COUNTIF($C$22:$C$103,C94)-COUNTIFS($C$22:$C$103,C94,$J$22:$J$103,\"Team\"))))","v":""},"",null,"",{"$f":"IF(T94=\"\",IF(L94=\"Belt & age\",IF(V94=\"\",IF(E94=\"m\",\"Boys \"&VLOOKUP(G94,INFO!B$19:C$27,2,0),\"Girls \"&VLOOKUP(G94,INFO!B$47:C$55,2,0)),V94),IF(L94=\"weight\",\"\",V94)),IF(J94=\"Team\",W94,IF(T94<14,\"Children\",IF(T94<16,\"Cadet\",IF(T94<18,\"Junior\",IF(T94<21,\"Under 21\",IF(T94<40,\"Senior\",\"Veterans\"))))&\" Opens\")))","v":""},{"$f":"IF(F94>=14,IF(L94=\"Belt & Age\",IF(G94=\"black\",\"NO SUCH DIVISION!!!\",\"Development\"),\"\"),\"\")","v":""}]
["",{"$f":"IF(C95=\"\",\"\",IF(C95=C94,B94,IF(MATCH(C95,C$22:C$103,0)>=(ROW()-51),MAX(B$22:B94)+1,INDIRECT(\"b\"&(MATCH(C95,C$22:C$103,0)+51),1))))","v":""},null,null,null,"",null,{"$f":"IF(F95=\"\",\"\",IF(F95<=13,\"Children\",IF(F95<=15,\"Cadet\",IF(F95<=17,\"Junior\",\"Senior\"))))","v":""},"",null,null,null,null,null,"","",{"$f":"IF(C95=\"\",\"\",IF(J95=\"Team\",\"Team\",IF(COUNTIF($C$22:$C$103,C95)-COUNTIFS($C$22:$C$103,C95,$J$22:$J$103,\"Team\")>COUNTIF($C$22:$C95,C95)-COUNTIFS($C$22:$C95,C95,$J$22:$J95,\"Team\"),\"\",COUNTIF($C$22:$C$103,C95)-COUNTIFS($C$22:$C$103,C95,$J$22:$J$103,\"Team\"))))","v":""},"",null,"",{"$f":"IF(T95=\"\",IF(L95=\"Belt & age\",IF(V95=\"\",IF(E95=\"m\",\"Boys \"&VLOOKUP(G95,INFO!B$19:C$27,2,0),\"Girls \"&VLOOKUP(G95,INFO!B$47:C$55,2,0)),V95),IF(L95=\"weight\",\"\",V95)),IF(J95=\"Team\",W95,IF(T95<14,\"Children\",IF(T95<16,\"Cadet\",IF(T95<18,\"Junior\",IF(T95<21,\"Under 21\",IF(T95<40,\"Senior\",\"Veterans\"))))&\" Opens\")))","v":""},{"$f":"IF(F95>=14,IF(L95=\"Belt & Age\",IF(G95=\"black\",\"NO SUCH DIVISION!!!\",\"Development\"),\"\"),\"\")","v":""}]
[{"$f":"IF(C96=\"\",\"\",A95+1)","v":""},{"$f":"IF(C96=\"\",\"\",IF(C96=C95,B95,IF(MATCH(C96,C$22:C$103,0)>=(ROW()-51),MAX(B$22:B95)+1,INDIRECT(\"b\"&(MATCH(C96,C$22:C$103,0)+51),1))))","v":""},null,null,null,"",null,{"$f":"IF(F96=\"\",\"\",IF(F96<=13,\"Children\",IF(F96<=15,\"Cadet\",IF(F96<=17,\"Junior\",\"Senior\"))))","v":""},"",null,null,null,null,null,"","",{"$f":"IF(C96=\"\",\"\",IF(J96=\"Team\",\"Team\",IF(COUNTIF($C$22:$C$103,C96)-COUNTIFS($C$22:$C$103,C96,$J$22:$J$103,\"Team\")>COUNTIF($C$22:$C96,C96)-COUNTIFS($C$22:$C96,C96,$J$22:$J96,\"Team\"),\"\",COUNTIF($C$22:$C$103,C96)-COUNTIFS($C$22:$C$103,C96,$J$22:$J$103,\"Team\"))))","v":""},"",null,"",{"$f":"IF(T96=\"\",IF(L96=\"Belt & age\",IF(V96=\"\",IF(E96=\"m\",\"Boys \"&VLOOKUP(G96,INFO!B$19:C$27,2,0),\"Girls \"&VLOOKUP(G96,INFO!B$47:C$55,2,0)),V96),IF(L96=\"weight\",\"\",V96)),IF(J96=\"Team\",W96,IF(T96<14,\"Children\",IF(T96<16,\"Cadet\",IF(T96<18,\"Junior\",IF(T96<21,\"Under 21\",IF(T96<40,\"Senior\",\"Veterans\"))))&\" Opens\")))","v":""},{"$f":"IF(F96>=14,IF(L96=\"Belt & Age\",IF(G96=\"black\",\"NO SUCH DIVISION!!!\",\"Development\"),\"\"),\"\")","v":""}]
["",{"$f":"IF(C97=\"\",\"\",IF(C97=C96,B96,IF(MATCH(C97,C$22:C$103,0)>=(ROW()-51),MAX(B$22:B96)+1,INDIRECT(\"b\"&(MATCH(C97,C$22:C$103,0)+51),1))))","v":""},null,null,null,"",null,{"$f":"IF(F97=\"\",\"\",IF(F97<=13,\"Children\",IF(F97<=15,\"Cadet\",IF(F97<=17,\"Junior\",\"Senior\"))))","v":""},"",null,null,null,null,null,"","",{"$f":"IF(C97=\"\",\"\",IF(J97=\"Team\",\"Team\",IF(COUNTIF($C$22:$C$103,C97)-COUNTIFS($C$22:$C$103,C97,$J$22:$J$103,\"Team\")>COUNTIF($C$22:$C97,C97)-COUNTIFS($C$22:$C97,C97,$J$22:$J97,\"Team\"),\"\",COUNTIF($C$22:$C$103,C97)-COUNTIFS($C$22:$C$103,C97,$J$22:$J$103,\"Team\"))))","v":""},"",null,"",{"$f":"IF(T97=\"\",IF(L97=\"Belt & age\",IF(V97=\"\",IF(E97=\"m\",\"Boys \"&VLOOKUP(G97,INFO!B$19:C$27,2,0),\"Girls \"&VLOOKUP(G97,INFO!B$47:C$55,2,0)),V97),IF(L97=\"weight\",\"\",V97)),IF(J97=\"Team\",W97,IF(T97<14,\"Children\",IF(T97<16,\"Cadet\",IF(T97<18,\"Junior\",IF(T97<21,\"Under 21\",IF(T97<40,\"Senior\",\"Veterans\"))))&\" Opens\")))","v":""},{"$f":"IF(F97>=14,IF(L97=\"Belt & Age\",IF(G97=\"black\",\"NO SUCH DIVISION!!!\",\"Development\"),\"\"),\"\")","v":""}]
["",{"$f":"IF(C98=\"\",\"\",IF(C98=C97,B97,IF(MATCH(C98,C$22:C$103,0)>=(ROW()-51),MAX(B$22:B97)+1,INDIRECT(\"b\"&(MATCH(C98,C$22:C$103,0)+51),1))))","v":""},null,null,null,"",null,{"$f":"IF(F98=\"\",\"\",IF(F98<=13,\"Children\",IF(F98<=15,\"Cadet\",IF(F98<=17,\"Junior\",\"Senior\"))))","v":""},"",null,null,null,null,null,"","",{"$f":"IF(C98=\"\",\"\",IF(J98=\"Team\",\"Team\",IF(COUNTIF($C$22:$C$103,C98)-COUNTIFS($C$22:$C$103,C98,$J$22:$J$103,\"Team\")>COUNTIF($C$22:$C98,C98)-COUNTIFS($C$22:$C98,C98,$J$22:$J98,\"Team\"),\"\",COUNTIF($C$22:$C$103,C98)-COUNTIFS($C$22:$C$103,C98,$J$22:$J$103,\"Team\"))))","v":""},"",null,"",{"$f":"IF(T98=\"\",IF(L98=\"Belt & age\",IF(V98=\"\",IF(E98=\"m\",\"Boys \"&VLOOKUP(G98,INFO!B$19:C$27,2,0),\"Girls \"&VLOOKUP(G98,INFO!B$47:C$55,2,0)),V98),IF(L98=\"weight\",\"\",V98)),IF(J98=\"Team\",W98,IF(T98<14,\"Children\",IF(T98<16,\"Cadet\",IF(T98<18,\"Junior\",IF(T98<21,\"Under 21\",IF(T98<40,\"Senior\",\"Veterans\"))))&\" Opens\")))","v":""},{"$f":"IF(F98>=14,IF(L98=\"Belt & Age\",IF(G98=\"black\",\"NO SUCH DIVISION!!!\",\"Development\"),\"\"),\"\")","v":""}]
["",{"$f":"IF(C99=\"\",\"\",IF(C99=C98,B98,IF(MATCH(C99,C$22:C$103,0)>=(ROW()-51),MAX(B$22:B98)+1,INDIRECT(\"b\"&(MATCH(C99,C$22:C$103,0)+51),1))))","v":""},null,null,null,"",null,{"$f":"IF(F99=\"\",\"\",IF(F99<=13,\"Children\",IF(F99<=15,\"Cadet\",IF(F99<=17,\"Junior\",\"Senior\"))))","v":""},"",null,null,null,null,null,"","",{"$f":"IF(C99=\"\",\"\",IF(J99=\"Team\",\"Team\",IF(COUNTIF($C$22:$C$103,C99)-COUNTIFS($C$22:$C$103,C99,$J$22:$J$103,\"Team\")>COUNTIF($C$22:$C99,C99)-COUNTIFS($C$22:$C99,C99,$J$22:$J99,\"Team\"),\"\",COUNTIF($C$22:$C$103,C99)-COUNTIFS($C$22:$C$103,C99,$J$22:$J$103,\"Team\"))))","v":""},"",null,"",{"$f":"IF(T99=\"\",IF(L99=\"Belt & age\",IF(V99=\"\",IF(E99=\"m\",\"Boys \"&VLOOKUP(G99,INFO!B$19:C$27,2,0),\"Girls \"&VLOOKUP(G99,INFO!B$47:C$55,2,0)),V99),IF(L99=\"weight\",\"\",V99)),IF(J99=\"Team\",W99,IF(T99<14,\"Children\",IF(T99<16,\"Cadet\",IF(T99<18,\"Junior\",IF(T99<21,\"Under 21\",IF(T99<40,\"Senior\",\"Veterans\"))))&\" Opens\")))","v":""},{"$f":"IF(F99>=14,IF(L99=\"Belt & Age\",IF(G99=\"black\",\"NO SUCH DIVISION!!!\",\"Development\"),\"\"),\"\")","v":""}]
["",{"$f":"IF(C100=\"\",\"\",IF(C100=C99,B99,IF(MATCH(C100,C$22:C$103,0)>=(ROW()-51),MAX(B$22:B99)+1,INDIRECT(\"b\"&(MATCH(C100,C$22:C$103,0)+51),1))))","v":""},null,null,null,"",null,{"$f":"IF(F100=\"\",\"\",IF(F100<=13,\"Children\",IF(F100<=15,\"Cadet\",IF(F100<=17,\"Junior\",\"Senior\"))))","v":""},"",null,null,null,null,null,"","",{"$f":"IF(C100=\"\",\"\",IF(J100=\"Team\",\"Team\",IF(COUNTIF($C$22:$C$103,C100)-COUNTIFS($C$22:$C$103,C100,$J$22:$J$103,\"Team\")>COUNTIF($C$22:$C100,C100)-COUNTIFS($C$22:$C100,C100,$J$22:$J100,\"Team\"),\"\",COUNTIF($C$22:$C$103,C100)-COUNTIFS($C$22:$C$103,C100,$J$22:$J$103,\"Team\"))))","v":""},"",null,"",{"$f":"IF(T100=\"\",IF(L100=\"Belt & age\",IF(V100=\"\",IF(E100=\"m\",\"Boys \"&VLOOKUP(G100,INFO!B$19:C$27,2,0),\"Girls \"&VLOOKUP(G100,INFO!B$47:C$55,2,0)),V100),IF(L100=\"weight\",\"\",V100)),IF(J100=\"Team\",W100,IF(T100<14,\"Children\",IF(T100<16,\"Cadet\",IF(T100<18,\"Junior\",IF(T100<21,\"Under 21\",IF(T100<40,\"Senior\",\"Veterans\"))))&\" Opens\")))","v":""},{"$f":"IF(F100>=14,IF(L100=\"Belt & Age\",IF(G100=\"black\",\"NO SUCH DIVISION!!!\",\"Development\"),\"\"),\"\")","v":""}]
["",{"$f":"IF(C101=\"\",\"\",IF(C101=C100,B100,IF(MATCH(C101,C$22:C$103,0)>=(ROW()-51),MAX(B$22:B100)+1,INDIRECT(\"b\"&(MATCH(C101,C$22:C$103,0)+51),1))))","v":""},null,null,null,"",null,{"$f":"IF(F101=\"\",\"\",IF(F101<=13,\"Children\",IF(F101<=15,\"Cadet\",IF(F101<=17,\"Junior\",\"Senior\"))))","v":""},"",null,null,null,null,null,"","",{"$f":"IF(C101=\"\",\"\",IF(J101=\"Team\",\"Team\",IF(COUNTIF($C$22:$C$103,C101)-COUNTIFS($C$22:$C$103,C101,$J$22:$J$103,\"Team\")>COUNTIF($C$22:$C101,C101)-COUNTIFS($C$22:$C101,C101,$J$22:$J101,\"Team\"),\"\",COUNTIF($C$22:$C$103,C101)-COUNTIFS($C$22:$C$103,C101,$J$22:$J$103,\"Team\"))))","v":""},"",null,"",{"$f":"IF(T101=\"\",IF(L101=\"Belt & age\",IF(V101=\"\",IF(E101=\"m\",\"Boys \"&VLOOKUP(G101,INFO!B$19:C$27,2,0),\"Girls \"&VLOOKUP(G101,INFO!B$47:C$55,2,0)),V101),IF(L101=\"weight\",\"\",V101)),IF(J101=\"Team\",W101,IF(T101<14,\"Children\",IF(T101<16,\"Cadet\",IF(T101<18,\"Junior\",IF(T101<21,\"Under 21\",IF(T101<40,\"Senior\",\"Veterans\"))))&\" Opens\")))","v":""},{"$f":"IF(F101>=14,IF(L101=\"Belt & Age\",IF(G101=\"black\",\"NO SUCH DIVISION!!!\",\"Development\"),\"\"),\"\")","v":""}]
["",{"$f":"IF(C102=\"\",\"\",IF(C102=C101,B101,IF(MATCH(C102,C$22:C$103,0)>=(ROW()-51),MAX(B$22:B101)+1,INDIRECT(\"b\"&(MATCH(C102,C$22:C$103,0)+51),1))))","v":""},null,null,null,"",null,{"$f":"IF(F102=\"\",\"\",IF(F102<=13,\"Children\",IF(F102<=15,\"Cadet\",IF(F102<=17,\"Junior\",\"Senior\"))))","v":""},"",null,null,null,null,null,"","",{"$f":"IF(C102=\"\",\"\",IF(J102=\"Team\",\"Team\",IF(COUNTIF($C$22:$C$103,C102)-COUNTIFS($C$22:$C$103,C102,$J$22:$J$103,\"Team\")>COUNTIF($C$22:$C102,C102)-COUNTIFS($C$22:$C102,C102,$J$22:$J102,\"Team\"),\"\",COUNTIF($C$22:$C$103,C102)-COUNTIFS($C$22:$C$103,C102,$J$22:$J$103,\"Team\"))))","v":""},"",null,"",{"$f":"IF(T102=\"\",IF(L102=\"Belt & age\",IF(V102=\"\",IF(E102=\"m\",\"Boys \"&VLOOKUP(G102,INFO!B$19:C$27,2,0),\"Girls \"&VLOOKUP(G102,INFO!B$47:C$55,2,0)),V102),IF(L102=\"weight\",\"\",V102)),IF(J102=\"Team\",W102,IF(T102<14,\"Children\",IF(T102<16,\"Cadet\",IF(T102<18,\"Junior\",IF(T102<21,\"Under 21\",IF(T102<40,\"Senior\",\"Veterans\"))))&\" Opens\")))","v":""},{"$f":"IF(F102>=14,IF(L102=\"Belt & Age\",IF(G102=\"black\",\"NO SUCH DIVISION!!!\",\"Development\"),\"\"),\"\")","v":""}]
["",{"$f":"IF(C103=\"\",\"\",IF(C103=C102,B102,IF(MATCH(C103,C$22:C$103,0)>=(ROW()-51),MAX(B$22:B102)+1,INDIRECT(\"b\"&(MATCH(C103,C$22:C$103,0)+51),1))))","v":""},null,null,null,"",null,{"$f":"IF(F103=\"\",\"\",IF(F103<=13,\"Children\",IF(F103<=15,\"Cadet\",IF(F103<=17,\"Junior\",\"Senior\"))))","v":""},"",null,null,null,null,null,"","",{"$f":"IF(C103=\"\",\"\",IF(J103=\"Team\",\"Team\",IF(COUNTIF($C$22:$C$103,C103)-COUNTIFS($C$22:$C$103,C103,$J$22:$J$103,\"Team\")>COUNTIF($C$22:$C103,C103)-COUNTIFS($C$22:$C103,C103,$J$22:$J103,\"Team\"),\"\",COUNTIF($C$22:$C$103,C103)-COUNTIFS($C$22:$C$103,C103,$J$22:$J$103,\"Team\"))))","v":""},"",null,"",{"$f":"IF(T103=\"\",IF(L103=\"Belt & age\",IF(V103=\"\",IF(E103=\"m\",\"Boys \"&VLOOKUP(G103,INFO!B$19:C$27,2,0),\"Girls \"&VLOOKUP(G103,INFO!B$47:C$55,2,0)),V103),IF(L103=\"weight\",\"\",V103)),IF(J103=\"Team\",W103,IF(T103<14,\"Children\",IF(T103<16,\"Cadet\",IF(T103<18,\"Junior\",IF(T103<21,\"Under 21\",IF(T103<40,\"Senior\",\"Veterans\"))))&\" Opens\")))","v":""},{"$f":"IF(F103>=14,IF(L103=\"Belt & Age\",IF(G103=\"black\",\"NO SUCH DIVISION!!!\",\"Development\"),\"\"),\"\")","v":""}]
[null,null,"TEAM EVENT RESERVES"]
[null,null,null,null,null,{"$f":"IF(D105=\"\",\"\",IF(MONTH($Q$1)>=MONTH(D105),IF(MONTH($Q$1)=MONTH(D105),IF(DAY($Q$1)>=DAY(D105),YEAR($Q$1)-YEAR(D105),YEAR($Q$1)-YEAR(D105)-1),YEAR($Q$1)-YEAR(D105)),YEAR($Q$1)-YEAR(D105)-1))","v":""},null,{"$f":"IF(F105=\"\",\"\",IF(F105<=13,\"Children\",IF(F105<=15,\"Cadet\",IF(F105<=17,\"Junior\",\"Senior\"))))","v":""},{"$f":"IF(C105=\"\",\"\",+$D$2)","v":""},null,null,null,null,null,{"$f":"IF(J105=\"Individual\",IF(K105=\"Kata\",\"X\",IF(K105=\"Superkata\",\"S\",\"\")),IF(K105=\"kata\",\"T\",\"\"))","v":""},{"$f":"IF(J105=\"Individual\",IF(K105=\"Kumite\",\"X\",\"\"),IF(K105=\"kumite\",\"T\",\"\"))","v":""},{"$f":"IF(C105=\"\",\"\",IF(J105=\"Team\",\"Team\",IF(B105=B106,IF(J106=\"Team\",COUNTIF($C$22:$C$103,C105)-COUNTIFS($C$22:$C$103,C105,$J$22:$J$103,\"Team\"),\"\"),IF(J105=\"Team\",\"Team\",COUNTIF($C$22:$C$103,C105)-COUNTIFS($C$22:$C$103,C105,$J$22:$J$103,\"Team\")))))","v":""},null,null,{"$f":"IF(L105=\"Open *\",IF(D105=\"\",\"\",IF(MONTH($Q$2)>=MONTH(D105),IF(MONTH($Q$2)=MONTH(D105),IF(DAY($Q$2)>=DAY(D105),YEAR($Q$2)-YEAR(D105),YEAR($Q$2)-YEAR(D105)-1),YEAR($Q$2)-YEAR(D105)),YEAR($Q$2)-YEAR(D105)-1)),\"\")","v":""},{"$f":"IF(T105=\"\",\"\",IF(T105<14,\"Children\",IF(T105<16,\"Cadet\",IF(T105<18,\"Junior\",\"Senior\"))&\" Opens\"))","v":""},{"$f":"IF(F105>=14,IF(L105=\"Belt & Age\",IF(OR(G105=\"brown\",G105=\"black\"),\"NO SUCH DIVISION!!!\",\"Development\"),\"\"))","v":""}]
[null,null,null,null,null,"",null,{"$f":"IF(F106=\"\",\"\",IF(F106<=13,\"Children\",IF(F106<=15,\"Cadet\",IF(F106<=17,\"Junior\",\"Senior\"))))","v":""},"",null,null,null,null,null,"","",{"$f":"IF(C106=\"\",\"\",IF(J106=\"Team\",\"Team\",IF(B106=B107,IF(J107=\"Team\",COUNTIF($C$22:$C$103,C106)-COUNTIFS($C$22:$C$103,C106,$J$22:$J$103,\"Team\"),\"\"),IF(J106=\"Team\",\"Team\",COUNTIF($C$22:$C$103,C106)-COUNTIFS($C$22:$C$103,C106,$J$22:$J$103,\"Team\")))))","v":""},null,null,"",{"$f":"IF(T106=\"\",\"\",IF(T106<14,\"Children\",IF(T106<16,\"Cadet\",IF(T106<18,\"Junior\",\"Senior\"))&\" Opens\"))","v":""},{"$f":"IF(F106>=14,IF(L106=\"Belt & Age\",IF(OR(G106=\"brown\",G106=\"black\"),\"NO SUCH DIVISION!!!\",\"Development\"),\"\"))","v":""}]
[null,null,null,null,null,"",null,{"$f":"IF(F107=\"\",\"\",IF(F107<=13,\"Children\",IF(F107<=15,\"Cadet\",IF(F107<=17,\"Junior\",\"Senior\"))))","v":""},"",null,null,null,null,null,"","",{"$f":"IF(C107=\"\",\"\",IF(J107=\"Team\",\"Team\",IF(B107=B108,IF(J108=\"Team\",COUNTIF($C$22:$C$103,C107)-COUNTIFS($C$22:$C$103,C107,$J$22:$J$103,\"Team\"),\"\"),IF(J107=\"Team\",\"Team\",COUNTIF($C$22:$C$103,C107)-COUNTIFS($C$22:$C$103,C107,$J$22:$J$103,\"Team\")))))","v":""},null,null,"",{"$f":"IF(T107=\"\",\"\",IF(T107<14,\"Children\",IF(T107<16,\"Cadet\",IF(T107<18,\"Junior\",\"Senior\"))&\" Opens\"))","v":""},{"$f":"IF(F107>=14,IF(L107=\"Belt & Age\",IF(OR(G107=\"brown\",G107=\"black\"),\"NO SUCH DIVISION!!!\",\"Development\"),\"\"))","v":""}]
[null,null,null,null,null,"",null,{"$f":"IF(F108=\"\",\"\",IF(F108<=13,\"Children\",IF(F108<=15,\"Cadet\",IF(F108<=17,\"Junior\",\"Senior\"))))","v":""},"",null,null,null,null,null,"","",{"$f":"IF(C108=\"\",\"\",IF(J108=\"Team\",\"Team\",IF(B108=B109,IF(J109=\"Team\",COUNTIF($C$22:$C$103,C108)-COUNTIFS($C$22:$C$103,C108,$J$22:$J$103,\"Team\"),\"\"),IF(J108=\"Team\",\"Team\",COUNTIF($C$22:$C$103,C108)-COUNTIFS($C$22:$C$103,C108,$J$22:$J$103,\"Team\")))))","v":""},null,null,"",{"$f":"IF(T108=\"\",\"\",IF(T108<14,\"Children\",IF(T108<16,\"Cadet\",IF(T108<18,\"Junior\",\"Senior\"))&\" Opens\"))","v":""},{"$f":"IF(F108>=14,IF(L108=\"Belt & Age\",IF(OR(G108=\"brown\",G108=\"black\"),\"NO SUCH DIVISION!!!\",\"Development\"),\"\"))","v":""}]
[null,null,null,null,null,"",null,{"$f":"IF(F109=\"\",\"\",IF(F109<=13,\"Children\",IF(F109<=15,\"Cadet\",IF(F109<=17,\"Junior\",\"Senior\"))))","v":""},"",null,null,null,null,null,"","",{"$f":"IF(C109=\"\",\"\",IF(J109=\"Team\",\"Team\",IF(B109=B110,IF(J110=\"Team\",COUNTIF($C$22:$C$103,C109)-COUNTIFS($C$22:$C$103,C109,$J$22:$J$103,\"Team\"),\"\"),IF(J109=\"Team\",\"Team\",COUNTIF($C$22:$C$103,C109)-COUNTIFS($C$22:$C$103,C109,$J$22:$J$103,\"Team\")))))","v":""},null,null,"",{"$f":"IF(T109=\"\",\"\",IF(T109<14,\"Children\",IF(T109<16,\"Cadet\",IF(T109<18,\"Junior\",\"Senior\"))&\" Opens\"))","v":""},{"$f":"IF(F109>=14,IF(L109=\"Belt & Age\",IF(OR(G109=\"brown\",G109=\"black\"),\"NO SUCH DIVISION!!!\",\"Development\"),\"\"))","v":""}]
[null,null,null,null,null,"",null,{"$f":"IF(F110=\"\",\"\",IF(F110<=13,\"Children\",IF(F110<=15,\"Cadet\",IF(F110<=17,\"Junior\",\"Senior\"))))","v":""},"",null,null,null,null,null,"","",{"$f":"IF(C110=\"\",\"\",IF(J110=\"Team\",\"Team\",IF(B110=B111,IF(J111=\"Team\",COUNTIF($C$22:$C$103,C110)-COUNTIFS($C$22:$C$103,C110,$J$22:$J$103,\"Team\"),\"\"),IF(J110=\"Team\",\"Team\",COUNTIF($C$22:$C$103,C110)-COUNTIFS($C$22:$C$103,C110,$J$22:$J$103,\"Team\")))))","v":""},null,null,"",{"$f":"IF(T110=\"\",\"\",IF(T110<14,\"Children\",IF(T110<16,\"Cadet\",IF(T110<18,\"Junior\",\"Senior\"))&\" Opens\"))","v":""},{"$f":"IF(F110>=14,IF(L110=\"Belt & Age\",IF(OR(G110=\"brown\",G110=\"black\"),\"NO SUCH DIVISION!!!\",\"Development\"),\"\"))","v":""}]
[null,null,null,null,null,"",null,{"$f":"IF(F111=\"\",\"\",IF(F111<=13,\"Children\",IF(F111<=15,\"Cadet\",IF(F111<=17,\"Junior\",\"Senior\"))))","v":""},"",null,null,null,null,null,"","",{"$f":"IF(C111=\"\",\"\",IF(J111=\"Team\",\"Team\",IF(B111=B112,IF(J112=\"Team\",COUNTIF($C$22:$C$103,C111)-COUNTIFS($C$22:$C$103,C111,$J$22:$J$103,\"Team\"),\"\"),IF(J111=\"Team\",\"Team\",COUNTIF($C$22:$C$103,C111)-COUNTIFS($C$22:$C$103,C111,$J$22:$J$103,\"Team\")))))","v":""},null,null,"",{"$f":"IF(T111=\"\",\"\",IF(T111<14,\"Children\",IF(T111<16,\"Cadet\",IF(T111<18,\"Junior\",\"Senior\"))&\" Opens\"))","v":""},{"$f":"IF(F111>=14,IF(L111=\"Belt & Age\",IF(OR(G111=\"brown\",G111=\"black\"),\"NO SUCH DIVISION!!!\",\"Development\"),\"\"))","v":""}]

{"sheet":"Entry form Page 2","index":1,"n_rows":111,"n_cols":22,"rows_kept":111,"cut":false,"hidden":false,"merged":[[0,10,0,13],[1,3,1,5],[0,16,0,18],[8,2,9,2],[8,3,8,5],[9,3,9,5],[10,3,10,5],[2,3,2,5],[3,3,3,5],[4,3,4,5],[5,3,5,5],[6,3,6,5],[7,3,7,5]]}
[null,null,"Karate League Entry Form",null,null,null,null,null,null,null,{"$f":"+'Entry form'!K1:N1","v":"  LIONS Challenge"},null,null,null,null,null,{"$f":"+'Entry form'!Q1:S1","v":"2015-08-15"}]
[null,null,"Club:",{"$f":"+'Entry form'!D2:F2","v":0},null,null,null,null,"Are you WKF affiliated?",null,null,null,"Name",null,null,null,{"$f":"+'Entry form'!Q2","v":"2015-11-01"}]
[null,null,"Contact Person:",{"$f":"+'Entry form'!D3:F3","v":0},null,null,null,null,null,null,null,"Referees:",{"$f":"+'Entry form'!M3","v":0}]
[null,null,"Tel No:",{"$f":"+'Entry form'!D4:F4","v":0},null,null,null,null,"YES",null,null,null,{"$f":"+'Entry form'!M4","v":0}]
[null,null,"E-Mail:",{"$f":"+'Entry form'!D5:F5","v":0},null,null,null,null,null,null,null,null,{"$f":"+'Entry form'!M5","v":0}]
[null,null,"Payment Details:",{"$f":"+'Entry form'!D6:F6","v":0},null,null,null,null,"NO",null,null,null,{"$f":"+'Entry form'!M6","v":0}]
[null,null,"Team Manager:",{"$f":"+'Entry form'!D7:F7","v":0},null,null,null,null,null,null,null,null,{"$f":"+'Entry form'!M7","v":0}]
[null,null,"Coaches:",{"$f":"+'Entry form'!D8:F8","v":0},null,null,null,null,null,null,null,"Table Officails:",{"$f":"+'Entry form'!M8","v":0}]
[null,null,null,{"$f":"+'Entry form'!D9:F9","v":0},null,null,null,null,null,null,null,null,{"$f":"+'Entry form'!M9","v":0}]
[null,null,null,{"$f":"+'Entry form'!D10:F10","v":0},null,null,null,null,null,null,null,null,{"$f":"+'Entry form'!M10","v":0}]
[null,null,null,{"$f":"+'Entry form'!D11:F11","v":0},null,null,null,null,null,null,null,null,{"$f":"+'Entry form'!M11","v":0}]
[null,null,null,null,"Total Entries:",{"$f":"COUNTA(C22:C103)","v":0},null,null,null,null,null,"Contestants:",{"$f":"MAX(B22:B103)","v":0}]
[null,null,null,null,"Payment Due:",{"$f":"SUM(R22:R104)","v":0},null,null,null,null,null,"Discount",null,null,null,null,"Nett Payable:",null,{"$f":"+F13-M13","v":0}]
[]
[null,null,"Name","DOB (dd/mm/yy)","Gender","Age","Belt ",null,"Club","Category","Event","Division (* - For Points)","Weight Category","Category","Kata","Kumite","Fee category","Fee ","Team Name"]
[{"$f":"IF(C16=\"\",\"\",1)","v":1},{"$f":"IF(C16=\"\",\"\",1)","v":1},"Example A","1995-04-19","M",{"$f":"IF(D16=\"\",\"\",IF(MONTH($Q$1)>=MONTH(D16),IF(MONTH($Q$1)=MONTH(D16),IF(DAY($Q$1)>=DAY(D16),YEAR($Q$1)-YEAR(D16),YEAR($Q$1)-YEAR(D16)-1),YEAR($Q$1)-YEAR(D16)),YEAR($Q$1)-YEAR(D16)-1))","v":20},"Red",{"$f":"IF(F16=\"\",\"\",IF(F16<=13,\"Children\",IF(F16<=15,\"Cadet\",IF(F16<=17,\"Junior\",\"Senior\"))))","v":"Senior"},{"$f":"IF(C16=\"\",\"\",+$D$2)","v":0},"Individual","Kata","Open *",null,{"$f":"IF(C15=\"\",\"\",U16)","v":"Senior Opens"},{"$f":"IF(K16=\"Kata\",\"X\",IF(K16=\"Team\",\"T\",\"\"))","v":"X"},{"$f":"IF(K16=\"Kumite\",\"X\",IF(K16=\"Team\",\"T\",\"\"))","v":""},{"$f":"IF(C16=\"\",\"\",IF(B16=B17,IF(B16=B19,\"\",IF(O17=\"T\",IF((COUNTIF($C$16:$C$21,C16)-COUNTIFS($C$16:$C$21,C16,$O$16:$O$21,\"T\"))>4,4,(COUNTIF($C$16:$C$21,C16)-COUNTIFS($C$16:$C$21,C16,$O$16:$O$21,\"T\"))),IF(O16=\"T\",\"Team\",\"\"))),1))","v":""},{"$f":"IF(Q16=\"\",\"\",IF(Q16=1,100,IF(Q16=2,180,IF(Q16=3,230,IF(Q16=\"Team\",70,250)))))","v":""},null,{"$f":"IF(L16=\"Open *\",IF(D16=\"\",\"\",IF(MONTH($Q$2)>=MONTH(D16),IF(MONTH($Q$2)=MONTH(D16),IF(DAY($Q$2)>=DAY(D16),YEAR($Q$2)-YEAR(D16),YEAR($Q$2)-YEAR(D16)-1),YEAR($Q$2)-YEAR(D16)),YEAR($Q$2)-YEAR(D16)-1)),\"\")","v":20},{"$f":"IF(T16=\"\",IF(L16=\"Belt & age\",IF(V16=\"\",IF(E16=\"m\",\"Boys \"&VLOOKUP(G16,INFO!B$19:C$27,2,0),\"Girls \"&VLOOKUP(G16,INFO!B$47:C$55,2,0)),V16),IF(L16=\"weight\",\"\",V16)),IF(J16=\"Team\",W16,IF(T16<14,\"Children\",IF(T16<16,\"Cadet\",IF(T16<18,\"Junior\",IF(T16<40,\"Senior\",\"Veterans\"))))&\" Opens\"))","v":"Senior Opens"},{"$f":"IF(F16>=14,IF(L16=\"Belt & Age\",IF(OR(G16=\"brown\",G16=\"black\"),\"NO SUCH DIVISION!!!\",\"Development\"),\"\"),\"\")","v":""}]
[{"$f":"IF(C17=\"\",\"\",A16+1)","v":2},{"$f":"IF(C17=\"\",\"\",IF(C17=C16,B16,B16+1))","v":1},"Example A","1995-04-19","M",20,"Red","Senior",{"$f":"IF(C17=\"\",\"\",+$D$2)","v":0},"Individual","Kumite","Open *",null,"Senior Opens",{"$f":"IF(J17=\"Individual\",IF(K17=\"Kata\",\"X\",IF(K17=\"Superkata\",\"S\",\"\")),IF(K17=\"kata\",\"T\",\"\"))","v":""},{"$f":"IF(J17=\"Individual\",IF(K17=\"Kumite\",\"X\",\"\"),IF(K17=\"kumite\",\"T\",\"\"))","v":"X"},{"$f":"IF(C17=\"\",\"\",IF(J17=\"Team\",\"Team\",IF(B17=B19,IF(J19=\"Team\",COUNTIF($C$16:$C$21,C17)-COUNTIFS($C$16:$C$21,C17,$J$16:$J$21,\"Team\"),\"\"),IF(J17=\"Team\",\"Team\",COUNTIF($C$16:$C$21,C17)-COUNTIFS($C$16:$C$21,C17,$J$16:$J$21,\"Team\")))))","v":""},{"$f":"IF(Q17=\"\",\"\",IF(Q17=1,100,IF(Q17=2,180,IF(Q17=3,230,IF(Q17=\"Team\",70,250)))))","v":""},null,20,{"$f":"IF(T17=\"\",IF(L17=\"Belt & age\",IF(V17=\"\",IF(E17=\"m\",\"Boys \"&VLOOKUP(G17,INFO!B$19:C$27,2,0),\"Girls \"&VLOOKUP(G17,INFO!B$47:C$55,2,0)),V17),IF(L17=\"weight\",\"\",V17)),IF(J17=\"Team\",W17,IF(T17<14,\"Children\",IF(T17<16,\"Cadet\",IF(T17<18,\"Junior\",IF(T17<40,\"Senior\",\"Veterans\"))))&\" Opens\"))","v":"Senior Opens"},{"$f":"IF(F17>=14,IF(L17=\"Belt & Age\",IF(OR(G17=\"brown\",G17=\"black\"),\"NO SUCH DIVISION!!!\",\"Development\"),\"\"),\"\")","v":""}]
[3,{"$f":"IF(C18=\"\",\"\",IF(C18=C16,B16,B16+1))","v":1},"Example A","1995-04-19","M",20,"Red","Senior",{"$f":"IF(C18=\"\",\"\",+$D$2)","v":0},"Individual","Kumite","Weight","Senior Male Under 75 kg","","","X",{"$f":"IF(C18=\"\",\"\",IF(J18=\"Team\",\"Team\",IF(B18=B19,IF(J19=\"Team\",COUNTIF($C$16:$C$21,C18)-COUNTIFS($C$16:$C$21,C18,$J$16:$J$21,\"Team\"),\"\"),IF(J18=\"Team\",\"Team\",COUNTIF($C$16:$C$21,C18)-COUNTIFS($C$16:$C$21,C18,$J$16:$J$21,\"Team\")))))","v":""},{"$f":"IF(Q18=\"\",\"\",IF(Q18=1,100,IF(Q18=2,180,IF(Q18=3,230,IF(Q18=\"Team\",70,250)))))","v":""},null,"",{"$f":"IF(T18=\"\",IF(L18=\"Belt & age\",IF(V18=\"\",IF(E18=\"m\",\"Boys \"&VLOOKUP(G18,INFO!B$19:C$27,2,0),\"Girls \"&VLOOKUP(G18,INFO!B$47:C$55,2,0)),V18),IF(L18=\"weight\",\"\",V18)),IF(J18=\"Team\",W18,IF(T18<14,\"Children\",IF(T18<16,\"Cadet\",IF(T18<18,\"Junior\",IF(T18<40,\"Senior\",\"Veterans\"))))&\" Opens\"))","v":""},{"$f":"IF(F18>=14,IF(L18=\"Belt & Age\",IF(OR(G18=\"brown\",G18=\"black\"),\"NO SUCH DIVISION!!!\",\"Development\"),\"\"),\"\")","v":""}]
[4,{"$f":"IF(C19=\"\",\"\",IF(C19=C17,B17,B17+1))","v":1},"Example A","1995-04-19","M",20,"Red","Senior",{"$f":"IF(C19=\"\",\"\",+$D$2)","v":0},"Individual","Kata","Belt & Age",null,"Development","X","",{"$f":"IF(C19=\"\",\"\",IF(J19=\"Team\",\"Team\",IF(B19=B20,IF(J20=\"Team\",COUNTIF($C$16:$C$21,C19)-COUNTIFS($C$16:$C$21,C19,$J$16:$J$21,\"Team\"),\"\"),IF(J19=\"Team\",\"Team\",COUNTIF($C$16:$C$21,C19)-COUNTIFS($C$16:$C$21,C19,$J$16:$J$21,\"Team\")))))","v":4},250,null,"",{"$f":"IF(T19=\"\",IF(L19=\"Belt & age\",IF(V19=\"\",IF(E19=\"m\",\"Boys \"&VLOOKUP(G19,INFO!B$19:C$27,2,0),\"Girls \"&VLOOKUP(G19,INFO!B$47:C$55,2,0)),V19),IF(L19=\"weight\",\"\",V19)),IF(J19=\"Team\",W19,IF(T19<14,\"Children\",IF(T19<16,\"Cadet\",IF(T19<18,\"Junior\",IF(T19<40,\"Senior\",\"Veterans\"))))&\" Opens\"))","v":"Development"},{"$f":"IF(F19>=14,IF(L19=\"Belt & Age\",IF(OR(G19=\"brown\",G19=\"black\"),\"NO SUCH DIVISION!!!\",\"Development\"),\"\"),\"\")","v":"Development"}]
[5,{"$f":"IF(C20=\"\",\"\",IF(C20=C19,B19,B19+1))","v":1},"Example A","1995-04-19","M",20,"Red","Senior",{"$f":"IF(C20=\"\",\"\",+$D$2)","v":0},"Team","Kata","Open *",null,"Senior *","T","",{"$f":"IF(C20=\"\",\"\",IF(J20=\"Team\",\"Team\",IF(B20=B21,IF(J21=\"Team\",COUNTIF($C$16:$C$21,C20)-COUNTIFS($C$16:$C$21,C20,$J$16:$J$21,\"Team\"),\"\"),IF(J20=\"Team\",\"Team\",COUNTIF($C$16:$C$21,C20)-COUNTIFS($C$16:$C$21,C20,$J$16:$J$21,\"Team\")))))","v":"Team"},70,"BEST A",20,{"$f":"IF(T20=\"\",IF(L20=\"Belt & age\",IF(V20=\"\",IF(E20=\"m\",\"Boys \"&VLOOKUP(G20,INFO!B$19:C$27,2,0),\"Girls \"&VLOOKUP(G20,INFO!B$47:C$55,2,0)),V20),IF(L20=\"weight\",\"\",V20)),IF(J20=\"Team\",W20,IF(T20<14,\"Children\",IF(T20<16,\"Cadet\",IF(T20<18,\"Junior\",IF(T20<40,\"Senior\",\"Veterans\"))))&\" Opens\"))","v":0},{"$f":"IF(F20>=14,IF(L20=\"Belt & Age\",IF(OR(G20=\"brown\",G20=\"black\"),\"NO SUCH DIVISION!!!\",\"Development\"),\"\"),\"\")","v":""}]
[6,{"$f":"IF(C21=\"\",\"\",IF(C21=C19,B19,B19+1))","v":1},"Example A","1995-04-19","M",20,"Red","Senior",{"$f":"IF(C21=\"\",\"\",+$D$2)","v":0},"Team","Kumite","Open *",null,"Senior *","","T",{"$f":"IF(C21=\"\",\"\",IF(J21=\"Team\",\"Team\",IF(B21=B22,IF(J22=\"Team\",COUNTIF($C$16:$C$21,C21)-COUNTIFS($C$16:$C$21,C21,$J$16:$J$21,\"Team\"),\"\"),IF(J21=\"Team\",\"Team\",COUNTIF($C$16:$C$21,C21)-COUNTIFS($C$16:$C$21,C21,$J$16:$J$21,\"Team\")))))","v":"Team"},70,"BEST B",20,{"$f":"IF(T21=\"\",IF(L21=\"Belt & age\",IF(V21=\"\",IF(E21=\"m\",\"Boys \"&VLOOKUP(G21,INFO!B$19:C$27,2,0),\"Girls \"&VLOOKUP(G21,INFO!B$47:C$55,2,0)),V21),IF(L21=\"weight\",\"\",V21)),IF(J21=\"Team\",W21,IF(T21<14,\"Children\",IF(T21<16,\"Cadet\",IF(T21<18,\"Junior\",IF(T21<40,\"Senior\",\"Veterans\"))))&\" Opens\"))","v":0},{"$f":"IF(F21>=14,IF(L21=\"Belt & Age\",IF(OR(G21=\"brown\",G21=\"black\"),\"NO SUCH DIVISION!!!\",\"Development\"),\"\"),\"\")","v":""}]
[{"$f":"IF(C22=\"\",\"\",1)","v":""},{"$f":"IF(C22=\"\",\"\",1)","v":""},null,null,null,"",null,{"$f":"IF(F22=\"\",\"\",IF(F22<=13,\"Children\",IF(F22<=15,\"Cadet\",IF(F22<=17,\"Junior\",\"Senior\"))))","v":""},{"$f":"IF(C22=\"\",\"\",+$D$2)","v":""},null,null,null,"",null,"","",{"$f":"IF(C22=\"\",\"\",IF(B22=B23,IF(B22=B24,\"\",IF(O23=\"T\",IF((COUNTIF($C$22:$C$66,C22)-COUNTIFS($C$22:$C$66,C22,$O$22:$O$66,\"T\"))>4,4,(COUNTIF($C$22:$C$66,C22)-COUNTIFS($C$22:$C$66,C22,$O$22:$O$66,\"T\"))),IF(O22=\"T\",\"Team\",\"\"))),1))","v":""},{"$f":"IF(Q22=\"\",\"\",IF(Q22=1,150,IF(Q22=2,250,IF(Q22=3,350,IF(Q22=\"team\",210/3,400)))))","v":""},null,"",{"$f":"IF(T22=\"\",IF(L22=\"Belt & age\",IF(V22=\"\",IF(E22=\"m\",\"Boys \"&VLOOKUP(G22,INFO!B$19:C$27,2,0),\"Girls \"&VLOOKUP(G22,INFO!B$47:C$55,2,0)),V22),IF(L22=\"weight\",\"\",V22)),IF(J22=\"Team\",W22,IF(T22<14,\"Children\",IF(T22<16,\"Cadet\",IF(T22<18,\"Junior\",IF(T22<21,\"Under 21\",IF(T22<40,\"Senior\",\"Veterans\"))))&\" Opens\")))","v":""},{"$f":"IF(F22>=14,IF(L22=\"Belt & Age\",IF(G22=\"black\",\"NO SUCH DIVISION!!!\",\"Development\"),\"\"),\"\")","v":""}]
[{"$f":"IF(C23=\"\",\"\",A22+1)","v":""},{"$f":"IF(C23=\"\",\"\",IF(C23=C22,B22,IF(MATCH(C23,C$1:C$71,0)>=(ROW()-51),MAX(B$1:B22)+1,INDIRECT(\"b\"&(MATCH(C23,C$1:C$71,0)+51),1))))","v":""},null,null,null,"",null,{"$f":"IF(F23=\"\",\"\",IF(F23<=13,\"Children\",IF(F23<=15,\"Cadet\",IF(F23<=17,\"Junior\",\"Senior\"))))","v":""},{"$f":"IF(C23=\"\",\"\",+$D$2)","v":""},null,null,null,null,null,"","",{"$f":"IF(C23=\"\",\"\",IF(J23=\"Team\",\"Team\",IF(COUNTIF($C$22:$C$103,C23)-COUNTIFS($C$22:$C$103,C23,$J$22:$J$103,\"Team\")>COUNTIF($C$22:$C23,C23)-COUNTIFS($C$22:$C23,C23,$J$22:$J23,\"Team\"),\"\",COUNTIF($C$22:$C$103,C23)-COUNTIFS($C$22:$C$103,C23,$J$22:$J$103,\"Team\"))))","v":""},{"$f":"IF(Q23=\"\",\"\",IF(Q23=1,150,IF(Q23=2,250,IF(Q23=3,350,IF(Q23=\"team\",210/3,400)))))","v":""},null,"",{"$f":"IF(T23=\"\",IF(L23=\"Belt & age\",IF(V23=\"\",IF(E23=\"m\",\"Boys \"&VLOOKUP(G23,INFO!B$19:C$27,2,0),\"Girls \"&VLOOKUP(G23,INFO!B$47:C$55,2,0)),V23),IF(L23=\"weight\",\"\",V23)),IF(J23=\"Team\",W23,IF(T23<14,\"Children\",IF(T23<16,\"Cadet\",IF(T23<18,\"Junior\",IF(T23<21,\"Under 21\",IF(T23<40,\"Senior\",\"Veterans\"))))&\" Opens\")))","v":""},{"$f":"IF(F23>=14,IF(L23=\"Belt & Age\",IF(G23=\"black\",\"NO SUCH DIVISION!!!\",\"Development\"),\"\"),\"\")","v":""}]
["",{"$f":"IF(C24=\"\",\"\",IF(C24=C23,B23,IF(MATCH(C24,C$1:C$71,0)>=(ROW()-51),MAX(B$1:B23)+1,INDIRECT(\"b\"&(MATCH(C24,C$1:C$71,0)+51),1))))","v":""},null,null,null,"",null,{"$f":"IF(F24=\"\",\"\",IF(F24<=13,\"Children\",IF(F24<=15,\"Cadet\",IF(F24<=17,\"Junior\",\"Senior\"))))","v":""},{"$f":"IF(C24=\"\",\"\",+$D$2)","v":""},null,null,null,null,null,"","",{"$f":"IF(C24=\"\",\"\",IF(J24=\"Team\",\"Team\",IF(COUNTIF($C$22:$C$103,C24)-COUNTIFS($C$22:$C$103,C24,$J$22:$J$103,\"Team\")>COUNTIF($C$22:$C24,C24)-COUNTIFS($C$22:$C24,C24,$J$22:$J24,\"Team\"),\"\",COUNTIF($C$22:$C$103,C24)-COUNTIFS($C$22:$C$103,C24,$J$22:$J$103,\"Team\"))))","v":""},{"$f":"IF(Q24=\"\",\"\",IF(Q24=1,150,IF(Q24=2,250,IF(Q24=3,350,IF(Q24=\"team\",210/3,400)))))","v":""},null,"",{"$f":"IF(T24=\"\",IF(L24=\"Belt & age\",IF(V24=\"\",IF(E24=\"m\",\"Boys \"&VLOOKUP(G24,INFO!B$19:C$27,2,0),\"Girls \"&VLOOKUP(G24,INFO!B$47:C$55,2,0)),V24),IF(L24=\"weight\",\"\",V24)),IF(J24=\"Team\",W24,IF(T24<14,\"Children\",IF(T24<16,\"Cadet\",IF(T24<18,\"Junior\",IF(T24<21,\"Under 21\",IF(T24<40,\"Senior\",\"Veterans\"))))&\" Opens\")))","v":""},""]
["",{"$f":"IF(C25=\"\",\"\",IF(C25=C24,B24,IF(MATCH(C25,C$1:C$71,0)>=(ROW()-51),MAX(B$1:B24)+1,INDIRECT(\"b\"&(MATCH(C25,C$1:C$71,0)+51),1))))","v":""},null,null,null,"",null,{"$f":"IF(F25=\"\",\"\",IF(F25<=13,\"Children\",IF(F25<=15,\"Cadet\",IF(F25<=17,\"Junior\",\"Senior\"))))","v":""},"",null,null,null,null,null,"","",{"$f":"IF(C25=\"\",\"\",IF(J25=\"Team\",\"Team\",IF(COUNTIF($C$22:$C$103,C25)-COUNTIFS($C$22:$C$103,C25,$J$22:$J$103,\"Team\")>COUNTIF($C$22:$C25,C25)-COUNTIFS($C$22:$C25,C25,$J$22:$J25,\"Team\"),\"\",COUNTIF($C$22:$C$103,C25)-COUNTIFS($C$22:$C$103,C25,$J$22:$J$103,\"Team\"))))","v":""},{"$f":"IF(Q25=\"\",\"\",IF(Q25=1,150,IF(Q25=2,250,IF(Q25=3,350,IF(Q25=\"team\",210/3,400)))))","v":""},null,"",{"$f":"IF(T25=\"\",IF(L25=\"Belt & age\",IF(V25=\"\",IF(E25=\"m\",\"Boys \"&VLOOKUP(G25,INFO!B$19:C$27,2,0),\"Girls \"&VLOOKUP(G25,INFO!B$47:C$55,2,0)),V25),IF(L25=\"weight\",\"\",V25)),IF(J25=\"Team\",W25,IF(T25<14,\"Children\",IF(T25<16,\"Cadet\",IF(T25<18,\"Junior\",IF(T25<21,\"Under 21\",IF(T25<40,\"Senior\",\"Veterans\"))))&\" Opens\")))","v":""},""]
["",{"$f":"IF(C26=\"\",\"\",IF(C26=C25,B25,IF(MATCH(C26,C$1:C$71,0)>=(ROW()-51),MAX(B$1:B25)+1,INDIRECT(\"b\"&(MATCH(C26,C$1:C$71,0)+51),1))))","v":""},null,null,null,"",null,{"$f":"IF(F26=\"\",\"\",IF(F26<=13,\"Children\",IF(F26<=15,\"Cadet\",IF(F26<=17,\"Junior\",\"Senior\"))))","v":""},"",null,null,null,null,null,"","",{"$f":"IF(C26=\"\",\"\",IF(J26=\"Team\",\"Team\",IF(COUNTIF($C$22:$C$103,C26)-COUNTIFS($C$22:$C$103,C26,$J$22:$J$103,\"Team\")>COUNTIF($C$22:$C26,C26)-COUNTIFS($C$22:$C26,C26,$J$22:$J26,\"Team\"),\"\",COUNTIF($C$22:$C$103,C26)-COUNTIFS($C$22:$C$103,C26,$J$22:$J$103,\"Team\"))))","v":""},{"$f":"IF(Q26=\"\",\"\",IF(Q26=1,150,IF(Q26=2,250,IF(Q26=3,350,IF(Q26=\"team\",210/3,400)))))","v":""},null,"",{"$f":"IF(T26=\"\",IF(L26=\"Belt & age\",IF(V26=\"\",IF(E26=\"m\",\"Boys \"&VLOOKUP(G26,INFO!B$19:C$27,2,0),\"Girls \"&VLOOKUP(G26,INFO!B$47:C$55,2,0)),V26),IF(L26=\"weight\",\"\",V26)),IF(J26=\"Team\",W26,IF(T26<14,\"Children\",IF(T26<16,\"Cadet\",IF(T26<18,\"Junior\",IF(T26<21,\"Under 21\",IF(T26<40,\"Senior\",\"Veterans\"))))&\" Opens\")))","v":""},""]
["",{"$f":"IF(C27=\"\",\"\",IF(C27=C26,B26,IF(MATCH(C27,C$1:C$71,0)>=(ROW()-51),MAX(B$1:B26)+1,INDIRECT(\"b\"&(MATCH(C27,C$1:C$71,0)+51),1))))","v":""},null,null,null,"",null,{"$f":"IF(F27=\"\",\"\",IF(F27<=13,\"Children\",IF(F27<=15,\"Cadet\",IF(F27<=17,\"Junior\",\"Senior\"))))","v":""},"",null,null,null,null,null,"","",{"$f":"IF(C27=\"\",\"\",IF(J27=\"Team\",\"Team\",IF(COUNTIF($C$22:$C$103,C27)-COUNTIFS($C$22:$C$103,C27,$J$22:$J$103,\"Team\")>COUNTIF($C$22:$C27,C27)-COUNTIFS($C$22:$C27,C27,$J$22:$J27,\"Team\"),\"\",COUNTIF($C$22:$C$103,C27)-COUNTIFS($C$22:$C$103,C27,$J$22:$J$103,\"Team\"))))","v":""},{"$f":"IF(Q27=\"\",\"\",IF(Q27=1,150,IF(Q27=2,250,IF(Q27=3,350,IF(Q27=\"team\",210/3,400)))))","v":""},null,"",{"$f":"IF(T27=\"\",IF(L27=\"Belt & age\",IF(V27=\"\",IF(E27=\"m\",\"Boys \"&VLOOKUP(G27,INFO!B$19:C$27,2,0),\"Girls \"&VLOOKUP(G27,INFO!B$47:C$55,2,0)),V27),IF(L27=\"weight\",\"\",V27)),IF(J27=\"Team\",W27,IF(T27<14,\"Children\",IF(T27<16,\"Cadet\",IF(T27<18,\"Junior\",IF(T27<21,\"Under 21\",IF(T27<40,\"Senior\",\"Veterans\"))))&\" Opens\")))","v":""},""]
["",{"$f":"IF(C28=\"\",\"\",IF(C28=C27,B27,IF(MATCH(C28,C$1:C$71,0)>=(ROW()-51),MAX(B$1:B27)+1,INDIRECT(\"b\"&(MATCH(C28,C$1:C$71,0)+51),1))))","v":""},null,null,null,"",null,{"$f":"IF(F28=\"\",\"\",IF(F28<=13,\"Children\",IF(F28<=15,\"Cadet\",IF(F28<=17,\"Junior\",\"Senior\"))))","v":""},"",null,null,null,null,null,"","",{"$f":"IF(C28=\"\",\"\",IF(J28=\"Team\",\"Team\",IF(COUNTIF($C$22:$C$103,C28)-COUNTIFS($C$22:$C$103,C28,$J$22:$J$103,\"Team\")>COUNTIF($C$22:$C28,C28)-COUNTIFS($C$22:$C28,C28,$J$22:$J28,\"Team\"),\"\",COUNTIF($C$22:$C$103,C28)-COUNTIFS($C$22:$C$103,C28,$J$22:$J$103,\"Team\"))))","v":""},{"$f":"IF(Q28=\"\",\"\",IF(Q28=1,150,IF(Q28=2,250,IF(Q28=3,350,IF(Q28=\"team\",210/3,400)))))","v":""},null,"",{"$f":"IF(T28=\"\",IF(L28=\"Belt & age\",IF(V28=\"\",IF(E28=\"m\",\"Boys \"&VLOOKUP(G28,INFO!B$19:C$27,2,0),\"Girls \"&VLOOKUP(G28,INFO!B$47:C$55,2,0)),V28),IF(L28=\"weight\",\"\",V28)),IF(J28=\"Team\",W28,IF(T28<14,\"Children\",IF(T28<16,\"Cadet\",IF(T28<18,\"Junior\",IF(T28<21,\"Under 21\",IF(T28<40,\"Senior\",\"Veterans\"))))&\" Opens\")))","v":""},""]
["",{"$f":"IF(C29=\"\",\"\",IF(C29=C28,B28,IF(MATCH(C29,C$1:C$71,0)>=(ROW()-51),MAX(B$1:B28)+1,INDIRECT(\"b\"&(MATCH(C29,C$1:C$71,0)+51),1))))","v":""},null,null,null,"",null,{"$f":"IF(F29=\"\",\"\",IF(F29<=13,\"Children\",IF(F29<=15,\"Cadet\",IF(F29<=17,\"Junior\",\"Senior\"))))","v":""},"",null,null,null,null,null,"","",{"$f":"IF(C29=\"\",\"\",IF(J29=\"Team\",\"Team\",IF(COUNTIF($C$22:$C$103,C29)-COUNTIFS($C$22:$C$103,C29,$J$22:$J$103,\"Team\")>COUNTIF($C$22:$C29,C29)-COUNTIFS($C$22:$C29,C29,$J$22:$J29,\"Team\"),\"\",COUNTIF($C$22:$C$103,C29)-COUNTIFS($C$22:$C$103,C29,$J$22:$J$103,\"Team\"))))","v":""},{"$f":"IF(Q29=\"\",\"\",IF(Q29=1,150,IF(Q29=2,250,IF(Q29=3,350,IF(Q29=\"team\",210/3,400)))))","v":""},null,"",{"$f":"IF(T29=\"\",IF(L29=\"Belt & age\",IF(V29=\"\",IF(E29=\"m\",\"Boys \"&VLOOKUP(G29,INFO!B$19:C$27,2,0),\"Girls \"&VLOOKUP(G29,INFO!B$47:C$55,2,0)),V29),IF(L29=\"weight\",\"\",V29)),IF(J29=\"Team\",W29,IF(T29<14,\"Children\",IF(T29<16,\"Cadet\",IF(T29<18,\"Junior\",IF(T29<21,\"Under 21\",IF(T29<40,\"Senior\",\"Veterans\"))))&\" Opens\")))","v":""},""]
["",{"$f":"IF(C30=\"\",\"\",IF(C30=C29,B29,IF(MATCH(C30,C$1:C$71,0)>=(ROW()-51),MAX(B$1:B29)+1,INDIRECT(\"b\"&(MATCH(C30,C$1:C$71,0)+51),1))))","v":""},null,null,null,"",null,{"$f":"IF(F30=\"\",\"\",IF(F30<=13,\"Children\",IF(F30<=15,\"Cadet\",IF(F30<=17,\"Junior\",\"Senior\"))))","v":""},"",null,null,null,null,null,"","",{"$f":"IF(C30=\"\",\"\",IF(J30=\"Team\",\"Team\",IF(COUNTIF($C$22:$C$103,C30)-COUNTIFS($C$22:$C$103,C30,$J$22:$J$103,\"Team\")>COUNTIF($C$22:$C30,C30)-COUNTIFS($C$22:$C30,C30,$J$22:$J30,\"Team\"),\"\",COUNTIF($C$22:$C$103,C30)-COUNTIFS($C$22:$C$103,C30,$J$22:$J$103,\"Team\"))))","v":""},{"$f":"IF(Q30=\"\",\"\",IF(Q30=1,150,IF(Q30=2,250,IF(Q30=3,350,IF(Q30=\"team\",210/3,400)))))","v":""},null,"",{"$f":"IF(T30=\"\",IF(L30=\"Belt & age\",IF(V30=\"\",IF(E30=\"m\",\"Boys \"&VLOOKUP(G30,INFO!B$19:C$27,2,0),\"Girls \"&VLOOKUP(G30,INFO!B$47:C$55,2,0)),V30),IF(L30=\"weight\",\"\",V30)),IF(J30=\"Team\",W30,IF(T30<14,\"Children\",IF(T30<16,\"Cadet\",IF(T30<18,\"Junior\",IF(T30<21,\"Under 21\",IF(T30<40,\"Senior\",\"Veterans\"))))&\" Opens\")))","v":""},""]
["",{"$f":"IF(C31=\"\",\"\",IF(C31=C30,B30,IF(MATCH(C31,C$1:C$71,0)>=(ROW()-51),MAX(B$1:B30)+1,INDIRECT(\"b\"&(MATCH(C31,C$1:C$71,0)+51),1))))","v":""},null,null,null,"",null,{"$f":"IF(F31=\"\",\"\",IF(F31<=13,\"Children\",IF(F31<=15,\"Cadet\",IF(F31<=17,\"Junior\",\"Senior\"))))","v":""},"",null,null,null,null,null,"","",{"$f":"IF(C31=\"\",\"\",IF(J31=\"Team\",\"Team\",IF(COUNTIF($C$22:$C$103,C31)-COUNTIFS($C$22:$C$103,C31,$J$22:$J$103,\"Team\")>COUNTIF($C$22:$C31,C31)-COUNTIFS($C$22:$C31,C31,$J$22:$J31,\"Team\"),\"\",COUNTIF($C$22:$C$103,C31)-COUNTIFS($C$22:$C$103,C31,$J$22:$J$103,\"Team\"))))","v":""},{"$f":"IF(Q31=\"\",\"\",IF(Q31=1,150,IF(Q31=2,250,IF(Q31=3,350,IF(Q31=\"team\",210/3,400)))))","v":""},null,"",{"$f":"IF(T31=\"\",IF(L31=\"Belt & age\",IF(V31=\"\",IF(E31=\"m\",\"Boys \"&VLOOKUP(G31,INFO!B$19:C$27,2,0),\"Girls \"&VLOOKUP(G31,INFO!B$47:C$55,2,0)),V31),IF(L31=\"weight\",\"\",V31)),IF(J31=\"Team\",W31,IF(T31<14,\"Children\",IF(T31<16,\"Cadet\",IF(T31<18,\"Junior\",IF(T31<21,\"Under 21\",IF(T31<40,\"Senior\",\"Veterans\"))))&\" Opens\")))","v":""},""]
["",{"$f":"IF(C32=\"\",\"\",IF(C32=C31,B31,IF(MATCH(C32,C$1:C$71,0)>=(ROW()-51),MAX(B$1:B31)+1,INDIRECT(\"b\"&(MATCH(C32,C$1:C$71,0)+51),1))))","v":""},null,null,null,"",null,{"$f":"IF(F32=\"\",\"\",IF(F32<=13,\"Children\",IF(F32<=15,\"Cadet\",IF(F32<=17,\"Junior\",\"Senior\"))))","v":""},"",null,null,null,null,null,"","",{"$f":"IF(C32=\"\",\"\",IF(J32=\"Team\",\"Team\",IF(COUNTIF($C$22:$C$103,C32)-COUNTIFS($C$22:$C$103,C32,$J$22:$J$103,\"Team\")>COUNTIF($C$22:$C32,C32)-COUNTIFS($C$22:$C32,C32,$J$22:$J32,\"Team\"),\"\",COUNTIF($C$22:$C$103,C32)-COUNTIFS($C$22:$C$103,C32,$J$22:$J$103,\"Team\"))))","v":""},{"$f":"IF(Q32=\"\",\"\",IF(Q32=1,150,IF(Q32=2,250,IF(Q32=3,350,IF(Q32=\"team\",210/3,400)))))","v":""},null,"",{"$f":"IF(T32=\"\",IF(L32=\"Belt & age\",IF(V32=\"\",IF(E32=\"m\",\"Boys \"&VLOOKUP(G32,INFO!B$19:C$27,2,0),\"Girls \"&VLOOKUP(G32,INFO!B$47:C$55,2,0)),V32),IF(L32=\"weight\",\"\",V32)),IF(J32=\"Team\",W32,IF(T32<14,\"Children\",IF(T32<16,\"Cadet\",IF(T32<18,\"Junior\",IF(T32<21,\"Under 21\",IF(T32<40,\"Senior\",\"Veterans\"))))&\" Opens\")))","v":""},""]
["",{"$f":"IF(C33=\"\",\"\",IF(C33=C32,B32,IF(MATCH(C33,C$1:C$71,0)>=(ROW()-51),MAX(B$1:B32)+1,INDIRECT(\"b\"&(MATCH(C33,C$1:C$71,0)+51),1))))","v":""},null,null,null,"",null,{"$f":"IF(F33=\"\",\"\",IF(F33<=13,\"Children\",IF(F33<=15,\"Cadet\",IF(F33<=17,\"Junior\",\"Senior\"))))","v":""},"",null,null,null,null,null,"","",{"$f":"IF(C33=\"\",\"\",IF(J33=\"Team\",\"Team\",IF(COUNTIF($C$22:$C$103,C33)-COUNTIFS($C$22:$C$103,C33,$J$22:$J$103,\"Team\")>COUNTIF($C$22:$C33,C33)-COUNTIFS($C$22:$C33,C33,$J$22:$J33,\"Team\"),\"\",COUNTIF($C$22:$C$103,C33)-COUNTIFS($C$22:$C$103,C33,$J$22:$J$103,\"Team\"))))","v":""},{"$f":"IF(Q33=\"\",\"\",IF(Q33=1,150,IF(Q33=2,250,IF(Q33=3,350,IF(Q33=\"team\",210/3,400)))))","v":""},null,"",{"$f":"IF(T33=\"\",IF(L33=\"Belt & age\",IF(V33=\"\",IF(E33=\"m\",\"Boys \"&VLOOKUP(G33,INFO!B$19:C$27,2,0),\"Girls \"&VLOOKUP(G33,INFO!B$47:C$55,2,0)),V33),IF(L33=\"weight\",\"\",V33)),IF(J33=\"Team\",W33,IF(T33<14,\"Children\",IF(T33<16,\"Cadet\",IF(T33<18,\"Junior\",IF(T33<21,\"Under 21\",IF(T33<40,\"Senior\",\"Veterans\"))))&\" Opens\")))","v":""},""]
["",{"$f":"IF(C34=\"\",\"\",IF(C34=C33,B33,IF(MATCH(C34,C$1:C$71,0)>=(ROW()-51),MAX(B$1:B33)+1,INDIRECT(\"b\"&(MATCH(C34,C$1:C$71,0)+51),1))))","v":""},null,null,null,"",null,{"$f":"IF(F34=\"\",\"\",IF(F34<=13,\"Children\",IF(F34<=15,\"Cadet\",IF(F34<=17,\"Junior\",\"Senior\"))))","v":""},"",null,null,null,null,null,"","",{"$f":"IF(C34=\"\",\"\",IF(J34=\"Team\",\"Team\",IF(COUNTIF($C$22:$C$103,C34)-COUNTIFS($C$22:$C$103,C34,$J$22:$J$103,\"Team\")>COUNTIF($C$22:$C34,C34)-COUNTIFS($C$22:$C34,C34,$J$22:$J34,\"Team\"),\"\",COUNTIF($C$22:$C$103,C34)-COUNTIFS($C$22:$C$103,C34,$J$22:$J$103,\"Team\"))))","v":""},{"$f":"IF(Q34=\"\",\"\",IF(Q34=1,150,IF(Q34=2,250,IF(Q34=3,350,IF(Q34=\"team\",210/3,400)))))","v":""},null,"",{"$f":"IF(T34=\"\",IF(L34=\"Belt & age\",IF(V34=\"\",IF(E34=\"m\",\"Boys \"&VLOOKUP(G34,INFO!B$19:C$27,2,0),\"Girls \"&VLOOKUP(G34,INFO!B$47:C$55,2,0)),V34),IF(L34=\"weight\",\"\",V34)),IF(J34=\"Team\",W34,IF(T34<14,\"Children\",IF(T34<16,\"Cadet\",IF(T34<18,\"Junior\",IF(T34<21,\"Under 21\",IF(T34<40,\"Senior\",\"Veterans\"))))&\" Opens\")))","v":""},""]
["",{"$f":"IF(C35=\"\",\"\",IF(C35=C34,B34,IF(MATCH(C35,C$1:C$71,0)>=(ROW()-51),MAX(B$1:B34)+1,INDIRECT(\"b\"&(MATCH(C35,C$1:C$71,0)+51),1))))","v":""},null,null,null,"",null,{"$f":"IF(F35=\"\",\"\",IF(F35<=13,\"Children\",IF(F35<=15,\"Cadet\",IF(F35<=17,\"Junior\",\"Senior\"))))","v":""},"",null,null,null,null,null,"","",{"$f":"IF(C35=\"\",\"\",IF(J35=\"Team\",\"Team\",IF(COUNTIF($C$22:$C$103,C35)-COUNTIFS($C$22:$C$103,C35,$J$22:$J$103,\"Team\")>COUNTIF($C$22:$C35,C35)-COUNTIFS($C$22:$C35,C35,$J$22:$J35,\"Team\"),\"\",COUNTIF($C$22:$C$103,C35)-COUNTIFS($C$22:$C$103,C35,$J$22:$J$103,\"Team\"))))","v":""},{"$f":"IF(Q35=\"\",\"\",IF(Q35=1,150,IF(Q35=2,250,IF(Q35=3,350,IF(Q35=\"team\",210/3,400)))))","v":""},null,"",{"$f":"IF(T35=\"\",IF(L35=\"Belt & age\",IF(V35=\"\",IF(E35=\"m\",\"Boys \"&VLOOKUP(G35,INFO!B$19:C$27,2,0),\"Girls \"&VLOOKUP(G35,INFO!B$47:C$55,2,0)),V35),IF(L35=\"weight\",\"\",V35)),IF(J35=\"Team\",W35,IF(T35<14,\"Children\",IF(T35<16,\"Cadet\",IF(T35<18,\"Junior\",IF(T35<21,\"Under 21\",IF(T35<40,\"Senior\",\"Veterans\"))))&\" Opens\")))","v":""},""]
["",{"$f":"IF(C36=\"\",\"\",IF(C36=C35,B35,IF(MATCH(C36,C$1:C$71,0)>=(ROW()-51),MAX(B$1:B35)+1,INDIRECT(\"b\"&(MATCH(C36,C$1:C$71,0)+51),1))))","v":""},null,null,null,"",null,{"$f":"IF(F36=\"\",\"\",IF(F36<=13,\"Children\",IF(F36<=15,\"Cadet\",IF(F36<=17,\"Junior\",\"Senior\"))))","v":""},"",null,null,null,null,null,"","",{"$f":"IF(C36=\"\",\"\",IF(J36=\"Team\",\"Team\",IF(COUNTIF($C$22:$C$103,C36)-COUNTIFS($C$22:$C$103,C36,$J$22:$J$103,\"Team\")>COUNTIF($C$22:$C36,C36)-COUNTIFS($C$22:$C36,C36,$J$22:$J36,\"Team\"),\"\",COUNTIF($C$22:$C$103,C36)-COUNTIFS($C$22:$C$103,C36,$J$22:$J$103,\"Team\"))))","v":""},{"$f":"IF(Q36=\"\",\"\",IF(Q36=1,150,IF(Q36=2,250,IF(Q36=3,350,IF(Q36=\"team\",210/3,400)))))","v":""},null,"",{"$f":"IF(T36=\"\",IF(L36=\"Belt & age\",IF(V36=\"\",IF(E36=\"m\",\"Boys \"&VLOOKUP(G36,INFO!B$19:C$27,2,0),\"Girls \"&VLOOKUP(G36,INFO!B$47:C$55,2,0)),V36),IF(L36=\"weight\",\"\",V36)),IF(J36=\"Team\",W36,IF(T36<14,\"Children\",IF(T36<16,\"Cadet\",IF(T36<18,\"Junior\",IF(T36<21,\"Under 21\",IF(T36<40,\"Senior\",\"Veterans\"))))&\" Opens\")))","v":""},""]
["",{"$f":"IF(C37=\"\",\"\",IF(C37=C36,B36,IF(MATCH(C37,C$1:C$71,0)>=(ROW()-51),MAX(B$1:B36)+1,INDIRECT(\"b\"&(MATCH(C37,C$1:C$71,0)+51),1))))","v":""},null,null,null,"",null,{"$f":"IF(F37=\"\",\"\",IF(F37<=13,\"Children\",IF(F37<=15,\"Cadet\",IF(F37<=17,\"Junior\",\"Senior\"))))","v":""},"",null,null,null,null,null,"","",{"$f":"IF(C37=\"\",\"\",IF(J37=\"Team\",\"Team\",IF(COUNTIF($C$22:$C$103,C37)-COUNTIFS($C$22:$C$103,C37,$J$22:$J$103,\"Team\")>COUNTIF($C$22:$C37,C37)-COUNTIFS($C$22:$C37,C37,$J$22:$J37,\"Team\"),\"\",COUNTIF($C$22:$C$103,C37)-COUNTIFS($C$22:$C$103,C37,$J$22:$J$103,\"Team\"))))","v":""},{"$f":"IF(Q37=\"\",\"\",IF(Q37=1,150,IF(Q37=2,250,IF(Q37=3,350,IF(Q37=\"team\",210/3,400)))))","v":""},null,"",{"$f":"IF(T37=\"\",IF(L37=\"Belt & age\",IF(V37=\"\",IF(E37=\"m\",\"Boys \"&VLOOKUP(G37,INFO!B$19:C$27,2,0),\"Girls \"&VLOOKUP(G37,INFO!B$47:C$55,2,0)),V37),IF(L37=\"weight\",\"\",V37)),IF(J37=\"Team\",W37,IF(T37<14,\"Children\",IF(T37<16,\"Cadet\",IF(T37<18,\"Junior\",IF(T37<21,\"Under 21\",IF(T37<40,\"Senior\",\"Veterans\"))))&\" Opens\")))","v":""},""]
["",{"$f":"IF(C38=\"\",\"\",IF(C38=C37,B37,IF(MATCH(C38,C$1:C$71,0)>=(ROW()-51),MAX(B$1:B37)+1,INDIRECT(\"b\"&(MATCH(C38,C$1:C$71,0)+51),1))))","v":""},null,null,null,"",null,{"$f":"IF(F38=\"\",\"\",IF(F38<=13,\"Children\",IF(F38<=15,\"Cadet\",IF(F38<=17,\"Junior\",\"Senior\"))))","v":""},"",null,null,null,null,null,"","",{"$f":"IF(C38=\"\",\"\",IF(J38=\"Team\",\"Team\",IF(COUNTIF($C$22:$C$103,C38)-COUNTIFS($C$22:$C$103,C38,$J$22:$J$103,\"Team\")>COUNTIF($C$22:$C38,C38)-COUNTIFS($C$22:$C38,C38,$J$22:$J38,\"Team\"),\"\",COUNTIF($C$22:$C$103,C38)-COUNTIFS($C$22:$C$103,C38,$J$22:$J$103,\"Team\"))))","v":""},{"$f":"IF(Q38=\"\",\"\",IF(Q38=1,150,IF(Q38=2,250,IF(Q38=3,350,IF(Q38=\"team\",210/3,400)))))","v":""},null,"",{"$f":"IF(T38=\"\",IF(L38=\"Belt & age\",IF(V38=\"\",IF(E38=\"m\",\"Boys \"&VLOOKUP(G38,INFO!B$19:C$27,2,0),\"Girls \"&VLOOKUP(G38,INFO!B$47:C$55,2,0)),V38),IF(L38=\"weight\",\"\",V38)),IF(J38=\"Team\",W38,IF(T38<14,\"Children\",IF(T38<16,\"Cadet\",IF(T38<18,\"Junior\",IF(T38<21,\"Under 21\",IF(T38<40,\"Senior\",\"Veterans\"))))&\" Opens\")))","v":""},""]
["",{"$f":"IF(C39=\"\",\"\",IF(C39=C38,B38,IF(MATCH(C39,C$1:C$71,0)>=(ROW()-51),MAX(B$1:B38)+1,INDIRECT(\"b\"&(MATCH(C39,C$1:C$71,0)+51),1))))","v":""},null,null,null,"",null,{"$f":"IF(F39=\"\",\"\",IF(F39<=13,\"Children\",IF(F39<=15,\"Cadet\",IF(F39<=17,\"Junior\",\"Senior\"))))","v":""},"",null,null,null,null,null,"","",{"$f":"IF(C39=\"\",\"\",IF(J39=\"Team\",\"Team\",IF(COUNTIF($C$22:$C$103,C39)-COUNTIFS($C$22:$C$103,C39,$J$22:$J$103,\"Team\")>COUNTIF($C$22:$C39,C39)-COUNTIFS($C$22:$C39,C39,$J$22:$J39,\"Team\"),\"\",COUNTIF($C$22:$C$103,C39)-COUNTIFS($C$22:$C$103,C39,$J$22:$J$103,\"Team\"))))","v":""},{"$f":"IF(Q39=\"\",\"\",IF(Q39=1,150,IF(Q39=2,250,IF(Q39=3,350,IF(Q39=\"team\",210/3,400)))))","v":""},null,"",{"$f":"IF(T39=\"\",IF(L39=\"Belt & age\",IF(V39=\"\",IF(E39=\"m\",\"Boys \"&VLOOKUP(G39,INFO!B$19:C$27,2,0),\"Girls \"&VLOOKUP(G39,INFO!B$47:C$55,2,0)),V39),IF(L39=\"weight\",\"\",V39)),IF(J39=\"Team\",W39,IF(T39<14,\"Children\",IF(T39<16,\"Cadet\",IF(T39<18,\"Junior\",IF(T39<21,\"Under 21\",IF(T39<40,\"Senior\",\"Veterans\"))))&\" Opens\")))","v":""},""]
["",{"$f":"IF(C40=\"\",\"\",IF(C40=C39,B39,IF(MATCH(C40,C$1:C$71,0)>=(ROW()-51),MAX(B$1:B39)+1,INDIRECT(\"b\"&(MATCH(C40,C$1:C$71,0)+51),1))))","v":""},null,null,null,"",null,{"$f":"IF(F40=\"\",\"\",IF(F40<=13,\"Children\",IF(F40<=15,\"Cadet\",IF(F40<=17,\"Junior\",\"Senior\"))))","v":""},"",null,null,null,null,null,"","",{"$f":"IF(C40=\"\",\"\",IF(J40=\"Team\",\"Team\",IF(COUNTIF($C$22:$C$103,C40)-COUNTIFS($C$22:$C$103,C40,$J$22:$J$103,\"Team\")>COUNTIF($C$22:$C40,C40)-COUNTIFS($C$22:$C40,C40,$J$22:$J40,\"Team\"),\"\",COUNTIF($C$22:$C$103,C40)-COUNTIFS($C$22:$C$103,C40,$J$22:$J$103,\"Team\"))))","v":""},{"$f":"IF(Q40=\"\",\"\",IF(Q40=1,150,IF(Q40=2,250,IF(Q40=3,350,IF(Q40=\"team\",210/3,400)))))","v":""},null,"",{"$f":"IF(T40=\"\",IF(L40=\"Belt & age\",IF(V40=\"\",IF(E40=\"m\",\"Boys \"&VLOOKUP(G40,INFO!B$19:C$27,2,0),\"Girls \"&VLOOKUP(G40,INFO!B$47:C$55,2,0)),V40),IF(L40=\"weight\",\"\",V40)),IF(J40=\"Team\",W40,IF(T40<14,\"Children\",IF(T40<16,\"Cadet\",IF(T40<18,\"Junior\",IF(T40<21,\"Under 21\",IF(T40<40,\"Senior\",\"Veterans\"))))&\" Opens\")))","v":""},""]
["",{"$f":"IF(C41=\"\",\"\",IF(C41=C40,B40,IF(MATCH(C41,C$1:C$71,0)>=(ROW()-51),MAX(B$1:B40)+1,INDIRECT(\"b\"&(MATCH(C41,C$1:C$71,0)+51),1))))","v":""},null,null,null,"",null,{"$f":"IF(F41=\"\",\"\",IF(F41<=13,\"Children\",IF(F41<=15,\"Cadet\",IF(F41<=17,\"Junior\",\"Senior\"))))","v":""},"",null,null,null,null,null,"","",{"$f":"IF(C41=\"\",\"\",IF(J41=\"Team\",\"Team\",IF(COUNTIF($C$22:$C$103,C41)-COUNTIFS($C$22:$C$103,C41,$J$22:$J$103,\"Team\")>COUNTIF($C$22:$C41,C41)-COUNTIFS($C$22:$C41,C41,$J$22:$J41,\"Team\"),\"\",COUNTIF($C$22:$C$103,C41)-COUNTIFS($C$22:$C$103,C41,$J$22:$J$103,\"Team\"))))","v":""},{"$f":"IF(Q41=\"\",\"\",IF(Q41=1,150,IF(Q41=2,250,IF(Q41=3,350,IF(Q41=\"team\",210/3,400)))))","v":""},null,"",{"$f":"IF(T41=\"\",IF(L41=\"Belt & age\",IF(V41=\"\",IF(E41=\"m\",\"Boys \"&VLOOKUP(G41,INFO!B$19:C$27,2,0),\"Girls \"&VLOOKUP(G41,INFO!B$47:C$55,2,0)),V41),IF(L41=\"weight\",\"\",V41)),IF(J41=\"Team\",W41,IF(T41<14,\"Children\",IF(T41<16,\"Cadet\",IF(T41<18,\"Junior\",IF(T41<21,\"Under 21\",IF(T41<40,\"Senior\",\"Veterans\"))))&\" Opens\")))","v":""},""]
["",{"$f":"IF(C42=\"\",\"\",IF(C42=C41,B41,IF(MATCH(C42,C$1:C$71,0)>=(ROW()-51),MAX(B$1:B41)+1,INDIRECT(\"b\"&(MATCH(C42,C$1:C$71,0)+51),1))))","v":""},null,null,null,"",null,{"$f":"IF(F42=\"\",\"\",IF(F42<=13,\"Children\",IF(F42<=15,\"Cadet\",IF(F42<=17,\"Junior\",\"Senior\"))))","v":""},"",null,null,null,null,null,"","",{"$f":"IF(C42=\"\",\"\",IF(J42=\"Team\",\"Team\",IF(COUNTIF($C$22:$C$103,C42)-COUNTIFS($C$22:$C$103,C42,$J$22:$J$103,\"Team\")>COUNTIF($C$22:$C42,C42)-COUNTIFS($C$22:$C42,C42,$J$22:$J42,\"Team\"),\"\",COUNTIF($C$22:$C$103,C42)-COUNTIFS($C$22:$C$103,C42,$J$22:$J$103,\"Team\"))))","v":""},{"$f":"IF(Q42=\"\",\"\",IF(Q42=1,150,IF(Q42=2,250,IF(Q42=3,350,IF(Q42=\"team\",210/3,400)))))","v":""},null,"",{"$f":"IF(T42=\"\",IF(L42=\"Belt & age\",IF(V42=\"\",IF(E42=\"m\",\"Boys \"&VLOOKUP(G42,INFO!B$19:C$27,2,0),\"Girls \"&VLOOKUP(G42,INFO!B$47:C$55,2,0)),V42),IF(L42=\"weight\",\"\",V42)),IF(J42=\"Team\",W42,IF(T42<14,\"Children\",IF(T42<16,\"Cadet\",IF(T42<18,\"Junior\",IF(T42<21,\"Under 21\",IF(T42<40,\"Senior\",\"Veterans\"))))&\" Opens\")))","v":""},""]
["",{"$f":"IF(C43=\"\",\"\",IF(C43=C42,B42,IF(MATCH(C43,C$1:C$71,0)>=(ROW()-51),MAX(B$1:B42)+1,INDIRECT(\"b\"&(MATCH(C43,C$1:C$71,0)+51),1))))","v":""},null,null,null,"",null,{"$f":"IF(F43=\"\",\"\",IF(F43<=13,\"Children\",IF(F43<=15,\"Cadet\",IF(F43<=17,\"Junior\",\"Senior\"))))","v":""},"",null,null,null,null,null,"","",{"$f":"IF(C43=\"\",\"\",IF(J43=\"Team\",\"Team\",IF(COUNTIF($C$22:$C$103,C43)-COUNTIFS($C$22:$C$103,C43,$J$22:$J$103,\"Team\")>COUNTIF($C$22:$C43,C43)-COUNTIFS($C$22:$C43,C43,$J$22:$J43,\"Team\"),\"\",COUNTIF($C$22:$C$103,C43)-COUNTIFS($C$22:$C$103,C43,$J$22:$J$103,\"Team\"))))","v":""},{"$f":"IF(Q43=\"\",\"\",IF(Q43=1,150,IF(Q43=2,250,IF(Q43=3,350,IF(Q43=\"team\",210/3,400)))))","v":""},null,"",{"$f":"IF(T43=\"\",IF(L43=\"Belt & age\",IF(V43=\"\",IF(E43=\"m\",\"Boys \"&VLOOKUP(G43,INFO!B$19:C$27,2,0),\"Girls \"&VLOOKUP(G43,INFO!B$47:C$55,2,0)),V43),IF(L43=\"weight\",\"\",V43)),IF(J43=\"Team\",W43,IF(T43<14,\"Children\",IF(T43<16,\"Cadet\",IF(T43<18,\"Junior\",IF(T43<21,\"Under 21\",IF(T43<40,\"Senior\",\"Veterans\"))))&\" Opens\")))","v":""},""]
["",{"$f":"IF(C44=\"\",\"\",IF(C44=C43,B43,IF(MATCH(C44,C$1:C$71,0)>=(ROW()-51),MAX(B$1:B43)+1,INDIRECT(\"b\"&(MATCH(C44,C$1:C$71,0)+51),1))))","v":""},null,null,null,"",null,{"$f":"IF(F44=\"\",\"\",IF(F44<=13,\"Children\",IF(F44<=15,\"Cadet\",IF(F44<=17,\"Junior\",\"Senior\"))))","v":""},"",null,null,null,null,null,"","",{"$f":"IF(C44=\"\",\"\",IF(J44=\"Team\",\"Team\",IF(COUNTIF($C$22:$C$103,C44)-COUNTIFS($C$22:$C$103,C44,$J$22:$J$103,\"Team\")>COUNTIF($C$22:$C44,C44)-COUNTIFS($C$22:$C44,C44,$J$22:$J44,\"Team\"),\"\",COUNTIF($C$22:$C$103,C44)-COUNTIFS($C$22:$C$103,C44,$J$22:$J$103,\"Team\"))))","v":""},{"$f":"IF(Q44=\"\",\"\",IF(Q44=1,150,IF(Q44=2,250,IF(Q44=3,350,IF(Q44=\"team\",210/3,400)))))","v":""},null,"",{"$f":"IF(T44=\"\",IF(L44=\"Belt & age\",IF(V44=\"\",IF(E44=\"m\",\"Boys \"&VLOOKUP(G44,INFO!B$19:C$27,2,0),\"Girls \"&VLOOKUP(G44,INFO!B$47:C$55,2,0)),V44),IF(L44=\"weight\",\"\",V44)),IF(J44=\"Team\",W44,IF(T44<14,\"Children\",IF(T44<16,\"Cadet\",IF(T44<18,\"Junior\",IF(T44<21,\"Under 21\",IF(T44<40,\"Senior\",\"Veterans\"))))&\" Opens\")))","v":""},""]
["",{"$f":"IF(C45=\"\",\"\",IF(C45=C44,B44,IF(MATCH(C45,C$1:C$71,0)>=(ROW()-51),MAX(B$1:B44)+1,INDIRECT(\"b\"&(MATCH(C45,C$1:C$71,0)+51),1))))","v":""},null,null,null,"",null,{"$f":"IF(F45=\"\",\"\",IF(F45<=13,\"Children\",IF(F45<=15,\"Cadet\",IF(F45<=17,\"Junior\",\"Senior\"))))","v":""},"",null,null,null,null,null,"","",{"$f":"IF(C45=\"\",\"\",IF(J45=\"Team\",\"Team\",IF(COUNTIF($C$22:$C$103,C45)-COUNTIFS($C$22:$C$103,C45,$J$22:$J$103,\"Team\")>COUNTIF($C$22:$C45,C45)-COUNTIFS($C$22:$C45,C45,$J$22:$J45,\"Team\"),\"\",COUNTIF($C$22:$C$103,C45)-COUNTIFS($C$22:$C$103,C45,$J$22:$J$103,\"Team\"))))","v":""},{"$f":"IF(Q45=\"\",\"\",IF(Q45=1,150,IF(Q45=2,250,IF(Q45=3,350,IF(Q45=\"team\",210/3,400)))))","v":""},null,"",{"$f":"IF(T45=\"\",IF(L45=\"Belt & age\",IF(V45=\"\",IF(E45=\"m\",\"Boys \"&VLOOKUP(G45,INFO!B$19:C$27,2,0),\"Girls \"&VLOOKUP(G45,INFO!B$47:C$55,2,0)),V45),IF(L45=\"weight\",\"\",V45)),IF(J45=\"Team\",W45,IF(T45<14,\"Children\",IF(T45<16,\"Cadet\",IF(T45<18,\"Junior\",IF(T45<21,\"Under 21\",IF(T45<40,\"Senior\",\"Veterans\"))))&\" Opens\")))","v":""},""]
["",{"$f":"IF(C46=\"\",\"\",IF(C46=C45,B45,IF(MATCH(C46,C$1:C$71,0)>=(ROW()-51),MAX(B$1:B45)+1,INDIRECT(\"b\"&(MATCH(C46,C$1:C$71,0)+51),1))))","v":""},null,null,null,"",null,{"$f":"IF(F46=\"\",\"\",IF(F46<=13,\"Children\",IF(F46<=15,\"Cadet\",IF(F46<=17,\"Junior\",\"Senior\"))))","v":""},"",null,null,null,null,null,"","",{"$f":"IF(C46=\"\",\"\",IF(J46=\"Team\",\"Team\",IF(COUNTIF($C$22:$C$103,C46)-COUNTIFS($C$22:$C$103,C46,$J$22:$J$103,\"Team\")>COUNTIF($C$22:$C46,C46)-COUNTIFS($C$22:$C46,C46,$J$22:$J46,\"Team\"),\"\",COUNTIF($C$22:$C$103,C46)-COUNTIFS($C$22:$C$103,C46,$J$22:$J$103,\"Team\"))))","v":""},{"$f":"IF(Q46=\"\",\"\",IF(Q46=1,150,IF(Q46=2,250,IF(Q46=3,350,IF(Q46=\"team\",210/3,400)))))","v":""},null,"",{"$f":"IF(T46=\"\",IF(L46=\"Belt & age\",IF(V46=\"\",IF(E46=\"m\",\"Boys \"&VLOOKUP(G46,INFO!B$19:C$27,2,0),\"Girls \"&VLOOKUP(G46,INFO!B$47:C$55,2,0)),V46),IF(L46=\"weight\",\"\",V46)),IF(J46=\"Team\",W46,IF(T46<14,\"Children\",IF(T46<16,\"Cadet\",IF(T46<18,\"Junior\",IF(T46<21,\"Under 21\",IF(T46<40,\"Senior\",\"Veterans\"))))&\" Opens\")))","v":""},""]
["",{"$f":"IF(C47=\"\",\"\",IF(C47=C46,B46,IF(MATCH(C47,C$1:C$71,0)>=(ROW()-51),MAX(B$1:B46)+1,INDIRECT(\"b\"&(MATCH(C47,C$1:C$71,0)+51),1))))","v":""},null,null,null,"",null,{"$f":"IF(F47=\"\",\"\",IF(F47<=13,\"Children\",IF(F47<=15,\"Cadet\",IF(F47<=17,\"Junior\",\"Senior\"))))","v":""},"",null,null,null,null,null,"","",{"$f":"IF(C47=\"\",\"\",IF(J47=\"Team\",\"Team\",IF(COUNTIF($C$22:$C$103,C47)-COUNTIFS($C$22:$C$103,C47,$J$22:$J$103,\"Team\")>COUNTIF($C$22:$C47,C47)-COUNTIFS($C$22:$C47,C47,$J$22:$J47,\"Team\"),\"\",COUNTIF($C$22:$C$103,C47)-COUNTIFS($C$22:$C$103,C47,$J$22:$J$103,\"Team\"))))","v":""},{"$f":"IF(Q47=\"\",\"\",IF(Q47=1,150,IF(Q47=2,250,IF(Q47=3,350,IF(Q47=\"team\",210/3,400)))))","v":""},null,"",{"$f":"IF(T47=\"\",IF(L47=\"Belt & age\",IF(V47=\"\",IF(E47=\"m\",\"Boys \"&VLOOKUP(G47,INFO!B$19:C$27,2,0),\"Girls \"&VLOOKUP(G47,INFO!B$47:C$55,2,0)),V47),IF(L47=\"weight\",\"\",V47)),IF(J47=\"Team\",W47,IF(T47<14,\"Children\",IF(T47<16,\"Cadet\",IF(T47<18,\"Junior\",IF(T47<21,\"Under 21\",IF(T47<40,\"Senior\",\"Veterans\"))))&\" Opens\")))","v":""},""]
["",{"$f":"IF(C48=\"\",\"\",IF(C48=C47,B47,IF(MATCH(C48,C$1:C$71,0)>=(ROW()-51),MAX(B$1:B47)+1,INDIRECT(\"b\"&(MATCH(C48,C$1:C$71,0)+51),1))))","v":""},null,null,null,"",null,{"$f":"IF(F48=\"\",\"\",IF(F48<=13,\"Children\",IF(F48<=15,\"Cadet\",IF(F48<=17,\"Junior\",\"Senior\"))))","v":""},"",null,null,null,null,null,"","",{"$f":"IF(C48=\"\",\"\",IF(J48=\"Team\",\"Team\",IF(COUNTIF($C$22:$C$103,C48)-COUNTIFS($C$22:$C$103,C48,$J$22:$J$103,\"Team\")>COUNTIF($C$22:$C48,C48)-COUNTIFS($C$22:$C48,C48,$J$22:$J48,\"Team\"),\"\",COUNTIF($C$22:$C$103,C48)-COUNTIFS($C$22:$C$103,C48,$J$22:$J$103,\"Team\"))))","v":""},{"$f":"IF(Q48=\"\",\"\",IF(Q48=1,150,IF(Q48=2,250,IF(Q48=3,350,IF(Q48=\"team\",210/3,400)))))","v":""},null,"",{"$f":"IF(T48=\"\",IF(L48=\"Belt & age\",IF(V48=\"\",IF(E48=\"m\",\"Boys \"&VLOOKUP(G48,INFO!B$19:C$27,2,0),\"Girls \"&VLOOKUP(G48,INFO!B$47:C$55,2,0)),V48),IF(L48=\"weight\",\"\",V48)),IF(J48=\"Team\",W48,IF(T48<14,\"Children\",IF(T48<16,\"Cadet\",IF(T48<18,\"Junior\",IF(T48<21,\"Under 21\",IF(T48<40,\"Senior\",\"Veterans\"))))&\" Opens\")))","v":""},""]
["",{"$f":"IF(C49=\"\",\"\",IF(C49=C48,B48,IF(MATCH(C49,C$1:C$71,0)>=(ROW()-51),MAX(B$1:B48)+1,INDIRECT(\"b\"&(MATCH(C49,C$1:C$71,0)+51),1))))","v":""},null,null,null,"",null,{"$f":"IF(F49=\"\",\"\",IF(F49<=13,\"Children\",IF(F49<=15,\"Cadet\",IF(F49<=17,\"Junior\",\"Senior\"))))","v":""},"",null,null,null,null,null,"","",{"$f":"IF(C49=\"\",\"\",IF(J49=\"Team\",\"Team\",IF(COUNTIF($C$22:$C$103,C49)-COUNTIFS($C$22:$C$103,C49,$J$22:$J$103,\"Team\")>COUNTIF($C$22:$C49,C49)-COUNTIFS($C$22:$C49,C49,$J$22:$J49,\"Team\"),\"\",COUNTIF($C$22:$C$103,C49)-COUNTIFS($C$22:$C$103,C49,$J$22:$J$103,\"Team\"))))","v":""},{"$f":"IF(Q49=\"\",\"\",IF(Q49=1,150,IF(Q49=2,250,IF(Q49=3,350,IF(Q49=\"team\",210/3,400)))))","v":""},null,"",{"$f":"IF(T49=\"\",IF(L49=\"Belt & age\",IF(V49=\"\",IF(E49=\"m\",\"Boys \"&VLOOKUP(G49,INFO!B$19:C$27,2,0),\"Girls \"&VLOOKUP(G49,INFO!B$47:C$55,2,0)),V49),IF(L49=\"weight\",\"\",V49)),IF(J49=\"Team\",W49,IF(T49<14,\"Children\",IF(T49<16,\"Cadet\",IF(T49<18,\"Junior\",IF(T49<21,\"Under 21\",IF(T49<40,\"Senior\",\"Veterans\"))))&\" Opens\")))","v":""},""]
["",{"$f":"IF(C50=\"\",\"\",IF(C50=C49,B49,IF(MATCH(C50,C$1:C$71,0)>=(ROW()-51),MAX(B$1:B49)+1,INDIRECT(\"b\"&(MATCH(C50,C$1:C$71,0)+51),1))))","v":""},null,null,null,"",null,{"$f":"IF(F50=\"\",\"\",IF(F50<=13,\"Children\",IF(F50<=15,\"Cadet\",IF(F50<=17,\"Junior\",\"Senior\"))))","v":""},"",null,null,null,null,null,"","",{"$f":"IF(C50=\"\",\"\",IF(J50=\"Team\",\"Team\",IF(COUNTIF($C$22:$C$103,C50)-COUNTIFS($C$22:$C$103,C50,$J$22:$J$103,\"Team\")>COUNTIF($C$22:$C50,C50)-COUNTIFS($C$22:$C50,C50,$J$22:$J50,\"Team\"),\"\",COUNTIF($C$22:$C$103,C50)-COUNTIFS($C$22:$C$103,C50,$J$22:$J$103,\"Team\"))))","v":""},{"$f":"IF(Q50=\"\",\"\",IF(Q50=1,150,IF(Q50=2,250,IF(Q50=3,350,IF(Q50=\"team\",210/3,400)))))","v":""},null,"",{"$f":"IF(T50=\"\",IF(L50=\"Belt & age\",IF(V50=\"\",IF(E50=\"m\",\"Boys \"&VLOOKUP(G50,INFO!B$19:C$27,2,0),\"Girls \"&VLOOKUP(G50,INFO!B$47:C$55,2,0)),V50),IF(L50=\"weight\",\"\",V50)),IF(J50=\"Team\",W50,IF(T50<14,\"Children\",IF(T50<16,\"Cadet\",IF(T50<18,\"Junior\",IF(T50<21,\"Under 21\",IF(T50<40,\"Senior\",\"Veterans\"))))&\" Opens\")))","v":""},""]
["",{"$f":"IF(C51=\"\",\"\",IF(C51=C50,B50,IF(MATCH(C51,C$1:C$71,0)>=(ROW()-51),MAX(B$1:B50)+1,INDIRECT(\"b\"&(MATCH(C51,C$1:C$71,0)+51),1))))","v":""},null,null,null,"",null,{"$f":"IF(F51=\"\",\"\",IF(F51<=13,\"Children\",IF(F51<=15,\"Cadet\",IF(F51<=17,\"Junior\",\"Senior\"))))","v":""},"",null,null,null,null,null,"","",{"$f":"IF(C51=\"\",\"\",IF(J51=\"Team\",\"Team\",IF(COUNTIF($C$22:$C$103,C51)-COUNTIFS($C$22:$C$103,C51,$J$22:$J$103,\"Team\")>COUNTIF($C$22:$C51,C51)-COUNTIFS($C$22:$C51,C51,$J$22:$J51,\"Team\"),\"\",COUNTIF($C$22:$C$103,C51)-COUNTIFS($C$22:$C$103,C51,$J$22:$J$103,\"Team\"))))","v":""},{"$f":"IF(Q51=\"\",\"\",IF(Q51=1,150,IF(Q51=2,250,IF(Q51=3,350,IF(Q51=\"team\",210/3,400)))))","v":""},null,"",{"$f":"IF(T51=\"\",IF(L51=\"Belt & age\",IF(V51=\"\",IF(E51=\"m\",\"Boys \"&VLOOKUP(G51,INFO!B$19:C$27,2,0),\"Girls \"&VLOOKUP(G51,INFO!B$47:C$55,2,0)),V51),IF(L51=\"weight\",\"\",V51)),IF(J51=\"Team\",W51,IF(T51<14,\"Children\",IF(T51<16,\"Cadet\",IF(T51<18,\"Junior\",IF(T51<21,\"Under 21\",IF(T51<40,\"Senior\",\"Veterans\"))))&\" Opens\")))","v":""},""]
["",{"$f":"IF(C52=\"\",\"\",IF(C52=C51,B51,IF(MATCH(C52,C$1:C$71,0)>=(ROW()-51),MAX(B$1:B51)+1,INDIRECT(\"b\"&(MATCH(C52,C$1:C$71,0)+51),1))))","v":""},null,null,null,"",null,{"$f":"IF(F52=\"\",\"\",IF(F52<=13,\"Children\",IF(F52<=15,\"Cadet\",IF(F52<=17,\"Junior\",\"Senior\"))))","v":""},"",null,null,null,null,null,"","",{"$f":"IF(C52=\"\",\"\",IF(J52=\"Team\",\"Team\",IF(COUNTIF($C$22:$C$103,C52)-COUNTIFS($C$22:$C$103,C52,$J$22:$J$103,\"Team\")>COUNTIF($C$22:$C52,C52)-COUNTIFS($C$22:$C52,C52,$J$22:$J52,\"Team\"),\"\",COUNTIF($C$22:$C$103,C52)-COUNTIFS($C$22:$C$103,C52,$J$22:$J$103,\"Team\"))))","v":""},{"$f":"IF(Q52=\"\",\"\",IF(Q52=1,150,IF(Q52=2,250,IF(Q52=3,350,IF(Q52=\"team\",210/3,400)))))","v":""},null,"",{"$f":"IF(T52=\"\",IF(L52=\"Belt & age\",IF(V52=\"\",IF(E52=\"m\",\"Boys \"&VLOOKUP(G52,INFO!B$19:C$27,2,0),\"Girls \"&VLOOKUP(G52,INFO!B$47:C$55,2,0)),V52),IF(L52=\"weight\",\"\",V52)),IF(J52=\"Team\",W52,IF(T52<14,\"Children\",IF(T52<16,\"Cadet\",IF(T52<18,\"Junior\",IF(T52<21,\"Under 21\",IF(T52<40,\"Senior\",\"Veterans\"))))&\" Opens\")))","v":""},""]
["",{"$f":"IF(C53=\"\",\"\",IF(C53=C52,B52,IF(MATCH(C53,C$1:C$71,0)>=(ROW()-51),MAX(B$1:B52)+1,INDIRECT(\"b\"&(MATCH(C53,C$1:C$71,0)+51),1))))","v":""},null,null,null,"",null,{"$f":"IF(F53=\"\",\"\",IF(F53<=13,\"Children\",IF(F53<=15,\"Cadet\",IF(F53<=17,\"Junior\",\"Senior\"))))","v":""},"",null,null,null,null,null,"","",{"$f":"IF(C53=\"\",\"\",IF(J53=\"Team\",\"Team\",IF(COUNTIF($C$22:$C$103,C53)-COUNTIFS($C$22:$C$103,C53,$J$22:$J$103,\"Team\")>COUNTIF($C$22:$C53,C53)-COUNTIFS($C$22:$C53,C53,$J$22:$J53,\"Team\"),\"\",COUNTIF($C$22:$C$103,C53)-COUNTIFS($C$22:$C$103,C53,$J$22:$J$103,\"Team\"))))","v":""},{"$f":"IF(Q53=\"\",\"\",IF(Q53=1,150,IF(Q53=2,250,IF(Q53=3,350,IF(Q53=\"team\",210/3,400)))))","v":""},null,"",{"$f":"IF(T53=\"\",IF(L53=\"Belt & age\",IF(V53=\"\",IF(E53=\"m\",\"Boys \"&VLOOKUP(G53,INFO!B$19:C$27,2,0),\"Girls \"&VLOOKUP(G53,INFO!B$47:C$55,2,0)),V53),IF(L53=\"weight\",\"\",V53)),IF(J53=\"Team\",W53,IF(T53<14,\"Children\",IF(T53<16,\"Cadet\",IF(T53<18,\"Junior\",IF(T53<21,\"Under 21\",IF(T53<40,\"Senior\",\"Veterans\"))))&\" Opens\")))","v":""},""]
["",{"$f":"IF(C54=\"\",\"\",IF(C54=C53,B53,IF(MATCH(C54,C$1:C$71,0)>=(ROW()-51),MAX(B$1:B53)+1,INDIRECT(\"b\"&(MATCH(C54,C$1:C$71,0)+51),1))))","v":""},null,null,null,"",null,{"$f":"IF(F54=\"\",\"\",IF(F54<=13,\"Children\",IF(F54<=15,\"Cadet\",IF(F54<=17,\"Junior\",\"Senior\"))))","v":""},"",null,null,null,null,null,"","",{"$f":"IF(C54=\"\",\"\",IF(J54=\"Team\",\"Team\",IF(COUNTIF($C$22:$C$103,C54)-COUNTIFS($C$22:$C$103,C54,$J$22:$J$103,\"Team\")>COUNTIF($C$22:$C54,C54)-COUNTIFS($C$22:$C54,C54,$J$22:$J54,\"Team\"),\"\",COUNTIF($C$22:$C$103,C54)-COUNTIFS($C$22:$C$103,C54,$J$22:$J$103,\"Team\"))))","v":""},{"$f":"IF(Q54=\"\",\"\",IF(Q54=1,150,IF(Q54=2,250,IF(Q54=3,350,IF(Q54=\"team\",210/3,400)))))","v":""},null,"",{"$f":"IF(T54=\"\",IF(L54=\"Belt & age\",IF(V54=\"\",IF(E54=\"m\",\"Boys \"&VLOOKUP(G54,INFO!B$19:C$27,2,0),\"Girls \"&VLOOKUP(G54,INFO!B$47:C$55,2,0)),V54),IF(L54=\"weight\",\"\",V54)),IF(J54=\"Team\",W54,IF(T54<14,\"Children\",IF(T54<16,\"Cadet\",IF(T54<18,\"Junior\",IF(T54<21,\"Under 21\",IF(T54<40,\"Senior\",\"Veterans\"))))&\" Opens\")))","v":""},""]
["",{"$f":"IF(C55=\"\",\"\",IF(C55=C54,B54,IF(MATCH(C55,C$1:C$71,0)>=(ROW()-51),MAX(B$1:B54)+1,INDIRECT(\"b\"&(MATCH(C55,C$1:C$71,0)+51),1))))","v":""},null,null,null,"",null,{"$f":"IF(F55=\"\",\"\",IF(F55<=13,\"Children\",IF(F55<=15,\"Cadet\",IF(F55<=17,\"Junior\",\"Senior\"))))","v":""},"",null,null,null,null,null,"","",{"$f":"IF(C55=\"\",\"\",IF(J55=\"Team\",\"Team\",IF(COUNTIF($C$22:$C$103,C55)-COUNTIFS($C$22:$C$103,C55,$J$22:$J$103,\"Team\")>COUNTIF($C$22:$C55,C55)-COUNTIFS($C$22:$C55,C55,$J$22:$J55,\"Team\"),\"\",COUNTIF($C$22:$C$103,C55)-COUNTIFS($C$22:$C$103,C55,$J$22:$J$103,\"Team\"))))","v":""},{"$f":"IF(Q55=\"\",\"\",IF(Q55=1,150,IF(Q55=2,250,IF(Q55=3,350,IF(Q55=\"team\",210/3,400)))))","v":""},null,"",{"$f":"IF(T55=\"\",IF(L55=\"Belt & age\",IF(V55=\"\",IF(E55=\"m\",\"Boys \"&VLOOKUP(G55,INFO!B$19:C$27,2,0),\"Girls \"&VLOOKUP(G55,INFO!B$47:C$55,2,0)),V55),IF(L55=\"weight\",\"\",V55)),IF(J55=\"Team\",W55,IF(T55<14,\"Children\",IF(T55<16,\"Cadet\",IF(T55<18,\"Junior\",IF(T55<21,\"Under 21\",IF(T55<40,\"Senior\",\"Veterans\"))))&\" Opens\")))","v":""},""]
["",{"$f":"IF(C56=\"\",\"\",IF(C56=C55,B55,IF(MATCH(C56,C$1:C$71,0)>=(ROW()-51),MAX(B$1:B55)+1,INDIRECT(\"b\"&(MATCH(C56,C$1:C$71,0)+51),1))))","v":""},null,null,null,"",null,{"$f":"IF(F56=\"\",\"\",IF(F56<=13,\"Children\",IF(F56<=15,\"Cadet\",IF(F56<=17,\"Junior\",\"Senior\"))))","v":""},"",null,null,null,null,null,"","",{"$f":"IF(C56=\"\",\"\",IF(J56=\"Team\",\"Team\",IF(COUNTIF($C$22:$C$103,C56)-COUNTIFS($C$22:$C$103,C56,$J$22:$J$103,\"Team\")>COUNTIF($C$22:$C56,C56)-COUNTIFS($C$22:$C56,C56,$J$22:$J56,\"Team\"),\"\",COUNTIF($C$22:$C$103,C56)-COUNTIFS($C$22:$C$103,C56,$J$22:$J$103,\"Team\"))))","v":""},{"$f":"IF(Q56=\"\",\"\",IF(Q56=1,150,IF(Q56=2,250,IF(Q56=3,350,IF(Q56=\"team\",210/3,400)))))","v":""},null,"",{"$f":"IF(T56=\"\",IF(L56=\"Belt & age\",IF(V56=\"\",IF(E56=\"m\",\"Boys \"&VLOOKUP(G56,INFO!B$19:C$27,2,0),\"Girls \"&VLOOKUP(G56,INFO!B$47:C$55,2,0)),V56),IF(L56=\"weight\",\"\",V56)),IF(J56=\"Team\",W56,IF(T56<14,\"Children\",IF(T56<16,\"Cadet\",IF(T56<18,\"Junior\",IF(T56<21,\"Under 21\",IF(T56<40,\"Senior\",\"Veterans\"))))&\" Opens\")))","v":""},""]
["",{"$f":"IF(C57=\"\",\"\",IF(C57=C56,B56,IF(MATCH(C57,C$1:C$71,0)>=(ROW()-51),MAX(B$1:B56)+1,INDIRECT(\"b\"&(MATCH(C57,C$1:C$71,0)+51),1))))","v":""},null,null,null,"",null,{"$f":"IF(F57=\"\",\"\",IF(F57<=13,\"Children\",IF(F57<=15,\"Cadet\",IF(F57<=17,\"Junior\",\"Senior\"))))","v":""},"",null,null,null,null,null,"","",{"$f":"IF(C57=\"\",\"\",IF(J57=\"Team\",\"Team\",IF(COUNTIF($C$22:$C$103,C57)-COUNTIFS($C$22:$C$103,C57,$J$22:$J$103,\"Team\")>COUNTIF($C$22:$C57,C57)-COUNTIFS($C$22:$C57,C57,$J$22:$J57,\"Team\"),\"\",COUNTIF($C$22:$C$103,C57)-COUNTIFS($C$22:$C$103,C57,$J$22:$J$103,\"Team\"))))","v":""},{"$f":"IF(Q57=\"\",\"\",IF(Q57=1,150,IF(Q57=2,250,IF(Q57=3,350,IF(Q57=\"team\",210/3,400)))))","v":""},null,"",{"$f":"IF(T57=\"\",IF(L57=\"Belt & age\",IF(V57=\"\",IF(E57=\"m\",\"Boys \"&VLOOKUP(G57,INFO!B$19:C$27,2,0),\"Girls \"&VLOOKUP(G57,INFO!B$47:C$55,2,0)),V57),IF(L57=\"weight\",\"\",V57)),IF(J57=\"Team\",W57,IF(T57<14,\"Children\",IF(T57<16,\"Cadet\",IF(T57<18,\"Junior\",IF(T57<21,\"Under 21\",IF(T57<40,\"Senior\",\"Veterans\"))))&\" Opens\")))","v":""},""]
["",{"$f":"IF(C58=\"\",\"\",IF(C58=C57,B57,IF(MATCH(C58,C$1:C$71,0)>=(ROW()-51),MAX(B$1:B57)+1,INDIRECT(\"b\"&(MATCH(C58,C$1:C$71,0)+51),1))))","v":""},null,null,null,"",null,{"$f":"IF(F58=\"\",\"\",IF(F58<=13,\"Children\",IF(F58<=15,\"Cadet\",IF(F58<=17,\"Junior\",\"Senior\"))))","v":""},"",null,null,null,null,null,"","",{"$f":"IF(C58=\"\",\"\",IF(J58=\"Team\",\"Team\",IF(COUNTIF($C$22:$C$103,C58)-COUNTIFS($C$22:$C$103,C58,$J$22:$J$103,\"Team\")>COUNTIF($C$22:$C58,C58)-COUNTIFS($C$22:$C58,C58,$J$22:$J58,\"Team\"),\"\",COUNTIF($C$22:$C$103,C58)-COUNTIFS($C$22:$C$103,C58,$J$22:$J$103,\"Team\"))))","v":""},{"$f":"IF(Q58=\"\",\"\",IF(Q58=1,150,IF(Q58=2,250,IF(Q58=3,350,IF(Q58=\"team\",210/3,400)))))","v":""},null,"",{"$f":"IF(T58=\"\",IF(L58=\"Belt & age\",IF(V58=\"\",IF(E58=\"m\",\"Boys \"&VLOOKUP(G58,INFO!B$19:C$27,2,0),\"Girls \"&VLOOKUP(G58,INFO!B$47:C$55,2,0)),V58),IF(L58=\"weight\",\"\",V58)),IF(J58=\"Team\",W58,IF(T58<14,\"Children\",IF(T58<16,\"Cadet\",IF(T58<18,\"Junior\",IF(T58<21,\"Under 21\",IF(T58<40,\"Senior\",\"Veterans\"))))&\" Opens\")))","v":""},""]
["",{"$f":"IF(C59=\"\",\"\",IF(C59=C58,B58,IF(MATCH(C59,C$1:C$71,0)>=(ROW()-51),MAX(B$1:B58)+1,INDIRECT(\"b\"&(MATCH(C59,C$1:C$71,0)+51),1))))","v":""},null,null,null,"",null,{"$f":"IF(F59=\"\",\"\",IF(F59<=13,\"Children\",IF(F59<=15,\"Cadet\",IF(F59<=17,\"Junior\",\"Senior\"))))","v":""},"",null,null,null,null,null,"","",{"$f":"IF(C59=\"\",\"\",IF(J59=\"Team\",\"Team\",IF(COUNTIF($C$22:$C$103,C59)-COUNTIFS($C$22:$C$103,C59,$J$22:$J$103,\"Team\")>COUNTIF($C$22:$C59,C59)-COUNTIFS($C$22:$C59,C59,$J$22:$J59,\"Team\"),\"\",COUNTIF($C$22:$C$103,C59)-COUNTIFS($C$22:$C$103,C59,$J$22:$J$103,\"Team\"))))","v":""},{"$f":"IF(Q59=\"\",\"\",IF(Q59=1,150,IF(Q59=2,250,IF(Q59=3,350,IF(Q59=\"team\",210/3,400)))))","v":""},null,"",{"$f":"IF(T59=\"\",IF(L59=\"Belt & age\",IF(V59=\"\",IF(E59=\"m\",\"Boys \"&VLOOKUP(G59,INFO!B$19:C$27,2,0),\"Girls \"&VLOOKUP(G59,INFO!B$47:C$55,2,0)),V59),IF(L59=\"weight\",\"\",V59)),IF(J59=\"Team\",W59,IF(T59<14,\"Children\",IF(T59<16,\"Cadet\",IF(T59<18,\"Junior\",IF(T59<21,\"Under 21\",IF(T59<40,\"Senior\",\"Veterans\"))))&\" Opens\")))","v":""},""]
["",{"$f":"IF(C60=\"\",\"\",IF(C60=C59,B59,IF(MATCH(C60,C$1:C$71,0)>=(ROW()-51),MAX(B$1:B59)+1,INDIRECT(\"b\"&(MATCH(C60,C$1:C$71,0)+51),1))))","v":""},null,null,null,"",null,{"$f":"IF(F60=\"\",\"\",IF(F60<=13,\"Children\",IF(F60<=15,\"Cadet\",IF(F60<=17,\"Junior\",\"Senior\"))))","v":""},"",null,null,null,null,null,"","",{"$f":"IF(C60=\"\",\"\",IF(J60=\"Team\",\"Team\",IF(COUNTIF($C$22:$C$103,C60)-COUNTIFS($C$22:$C$103,C60,$J$22:$J$103,\"Team\")>COUNTIF($C$22:$C60,C60)-COUNTIFS($C$22:$C60,C60,$J$22:$J60,\"Team\"),\"\",COUNTIF($C$22:$C$103,C60)-COUNTIFS($C$22:$C$103,C60,$J$22:$J$103,\"Team\"))))","v":""},{"$f":"IF(Q60=\"\",\"\",IF(Q60=1,150,IF(Q60=2,250,IF(Q60=3,350,IF(Q60=\"team\",210/3,400)))))","v":""},null,"",{"$f":"IF(T60=\"\",IF(L60=\"Belt & age\",IF(V60=\"\",IF(E60=\"m\",\"Boys \"&VLOOKUP(G60,INFO!B$19:C$27,2,0),\"Girls \"&VLOOKUP(G60,INFO!B$47:C$55,2,0)),V60),IF(L60=\"weight\",\"\",V60)),IF(J60=\"Team\",W60,IF(T60<14,\"Children\",IF(T60<16,\"Cadet\",IF(T60<18,\"Junior\",IF(T60<21,\"Under 21\",IF(T60<40,\"Senior\",\"Veterans\"))))&\" Opens\")))","v":""},""]
["",{"$f":"IF(C61=\"\",\"\",IF(C61=C60,B60,IF(MATCH(C61,C$1:C$71,0)>=(ROW()-51),MAX(B$1:B60)+1,INDIRECT(\"b\"&(MATCH(C61,C$1:C$71,0)+51),1))))","v":""},null,null,null,"",null,{"$f":"IF(F61=\"\",\"\",IF(F61<=13,\"Children\",IF(F61<=15,\"Cadet\",IF(F61<=17,\"Junior\",\"Senior\"))))","v":""},"",null,null,null,null,null,"","",{"$f":"IF(C61=\"\",\"\",IF(J61=\"Team\",\"Team\",IF(COUNTIF($C$22:$C$103,C61)-COUNTIFS($C$22:$C$103,C61,$J$22:$J$103,\"Team\")>COUNTIF($C$22:$C61,C61)-COUNTIFS($C$22:$C61,C61,$J$22:$J61,\"Team\"),\"\",COUNTIF($C$22:$C$103,C61)-COUNTIFS($C$22:$C$103,C61,$J$22:$J$103,\"Team\"))))","v":""},{"$f":"IF(Q61=\"\",\"\",IF(Q61=1,150,IF(Q61=2,250,IF(Q61=3,350,IF(Q61=\"team\",210/3,400)))))","v":""},null,"",{"$f":"IF(T61=\"\",IF(L61=\"Belt & age\",IF(V61=\"\",IF(E61=\"m\",\"Boys \"&VLOOKUP(G61,INFO!B$19:C$27,2,0),\"Girls \"&VLOOKUP(G61,INFO!B$47:C$55,2,0)),V61),IF(L61=\"weight\",\"\",V61)),IF(J61=\"Team\",W61,IF(T61<14,\"Children\",IF(T61<16,\"Cadet\",IF(T61<18,\"Junior\",IF(T61<21,\"Under 21\",IF(T61<40,\"Senior\",\"Veterans\"))))&\" Opens\")))","v":""},""]
["",{"$f":"IF(C62=\"\",\"\",IF(C62=C61,B61,IF(MATCH(C62,C$1:C$71,0)>=(ROW()-51),MAX(B$1:B61)+1,INDIRECT(\"b\"&(MATCH(C62,C$1:C$71,0)+51),1))))","v":""},null,null,null,"",null,{"$f":"IF(F62=\"\",\"\",IF(F62<=13,\"Children\",IF(F62<=15,\"Cadet\",IF(F62<=17,\"Junior\",\"Senior\"))))","v":""},"",null,null,null,null,null,"","",{"$f":"IF(C62=\"\",\"\",IF(J62=\"Team\",\"Team\",IF(COUNTIF($C$22:$C$103,C62)-COUNTIFS($C$22:$C$103,C62,$J$22:$J$103,\"Team\")>COUNTIF($C$22:$C62,C62)-COUNTIFS($C$22:$C62,C62,$J$22:$J62,\"Team\"),\"\",COUNTIF($C$22:$C$103,C62)-COUNTIFS($C$22:$C$103,C62,$J$22:$J$103,\"Team\"))))","v":""},{"$f":"IF(Q62=\"\",\"\",IF(Q62=1,150,IF(Q62=2,250,IF(Q62=3,350,IF(Q62=\"team\",210/3,400)))))","v":""},null,"",{"$f":"IF(T62=\"\",IF(L62=\"Belt & age\",IF(V62=\"\",IF(E62=\"m\",\"Boys \"&VLOOKUP(G62,INFO!B$19:C$27,2,0),\"Girls \"&VLOOKUP(G62,INFO!B$47:C$55,2,0)),V62),IF(L62=\"weight\",\"\",V62)),IF(J62=\"Team\",W62,IF(T62<14,\"Children\",IF(T62<16,\"Cadet\",IF(T62<18,\"Junior\",IF(T62<21,\"Under 21\",IF(T62<40,\"Senior\",\"Veterans\"))))&\" Opens\")))","v":""},""]
["",{"$f":"IF(C63=\"\",\"\",IF(C63=C62,B62,IF(MATCH(C63,C$1:C$71,0)>=(ROW()-51),MAX(B$1:B62)+1,INDIRECT(\"b\"&(MATCH(C63,C$1:C$71,0)+51),1))))","v":""},null,null,null,"",null,{"$f":"IF(F63=\"\",\"\",IF(F63<=13,\"Children\",IF(F63<=15,\"Cadet\",IF(F63<=17,\"Junior\",\"Senior\"))))","v":""},"",null,null,null,null,null,"","",{"$f":"IF(C63=\"\",\"\",IF(J63=\"Team\",\"Team\",IF(COUNTIF($C$22:$C$103,C63)-COUNTIFS($C$22:$C$103,C63,$J$22:$J$103,\"Team\")>COUNTIF($C$22:$C63,C63)-COUNTIFS($C$22:$C63,C63,$J$22:$J63,\"Team\"),\"\",COUNTIF($C$22:$C$103,C63)-COUNTIFS($C$22:$C$103,C63,$J$22:$J$103,\"Team\"))))","v":""},{"$f":"IF(Q63=\"\",\"\",IF(Q63=1,150,IF(Q63=2,250,IF(Q63=3,350,IF(Q63=\"team\",210/3,400)))))","v":""},null,"",{"$f":"IF(T63=\"\",IF(L63=\"Belt & age\",IF(V63=\"\",IF(E63=\"m\",\"Boys \"&VLOOKUP(G63,INFO!B$19:C$27,2,0),\"Girls \"&VLOOKUP(G63,INFO!B$47:C$55,2,0)),V63),IF(L63=\"weight\",\"\",V63)),IF(J63=\"Team\",W63,IF(T63<14,\"Children\",IF(T63<16,\"Cadet\",IF(T63<18,\"Junior\",IF(T63<21,\"Under 21\",IF(T63<40,\"Senior\",\"Veterans\"))))&\" Opens\")))","v":""},""]
["",{"$f":"IF(C64=\"\",\"\",IF(C64=C63,B63,IF(MATCH(C64,C$1:C$71,0)>=(ROW()-51),MAX(B$1:B63)+1,INDIRECT(\"b\"&(MATCH(C64,C$1:C$71,0)+51),1))))","v":""},null,null,null,"",null,{"$f":"IF(F64=\"\",\"\",IF(F64<=13,\"Children\",IF(F64<=15,\"Cadet\",IF(F64<=17,\"Junior\",\"Senior\"))))","v":""},"",null,null,null,null,null,"","",{"$f":"IF(C64=\"\",\"\",IF(J64=\"Team\",\"Team\",IF(COUNTIF($C$22:$C$103,C64)-COUNTIFS($C$22:$C$103,C64,$J$22:$J$103,\"Team\")>COUNTIF($C$22:$C64,C64)-COUNTIFS($C$22:$C64,C64,$J$22:$J64,\"Team\"),\"\",COUNTIF($C$22:$C$103,C64)-COUNTIFS($C$22:$C$103,C64,$J$22:$J$103,\"Team\"))))","v":""},{"$f":"IF(Q64=\"\",\"\",IF(Q64=1,150,IF(Q64=2,250,IF(Q64=3,350,IF(Q64=\"team\",210/3,400)))))","v":""},null,"",{"$f":"IF(T64=\"\",IF(L64=\"Belt & age\",IF(V64=\"\",IF(E64=\"m\",\"Boys \"&VLOOKUP(G64,INFO!B$19:C$27,2,0),\"Girls \"&VLOOKUP(G64,INFO!B$47:C$55,2,0)),V64),IF(L64=\"weight\",\"\",V64)),IF(J64=\"Team\",W64,IF(T64<14,\"Children\",IF(T64<16,\"Cadet\",IF(T64<18,\"Junior\",IF(T64<21,\"Under 21\",IF(T64<40,\"Senior\",\"Veterans\"))))&\" Opens\")))","v":""},""]
["",{"$f":"IF(C65=\"\",\"\",IF(C65=C64,B64,IF(MATCH(C65,C$1:C$71,0)>=(ROW()-51),MAX(B$1:B64)+1,INDIRECT(\"b\"&(MATCH(C65,C$1:C$71,0)+51),1))))","v":""},null,null,null,"",null,{"$f":"IF(F65=\"\",\"\",IF(F65<=13,\"Children\",IF(F65<=15,\"Cadet\",IF(F65<=17,\"Junior\",\"Senior\"))))","v":""},"",null,null,null,null,null,"","",{"$f":"IF(C65=\"\",\"\",IF(J65=\"Team\",\"Team\",IF(COUNTIF($C$22:$C$103,C65)-COUNTIFS($C$22:$C$103,C65,$J$22:$J$103,\"Team\")>COUNTIF($C$22:$C65,C65)-COUNTIFS($C$22:$C65,C65,$J$22:$J65,\"Team\"),\"\",COUNTIF($C$22:$C$103,C65)-COUNTIFS($C$22:$C$103,C65,$J$22:$J$103,\"Team\"))))","v":""},{"$f":"IF(Q65=\"\",\"\",IF(Q65=1,150,IF(Q65=2,250,IF(Q65=3,350,IF(Q65=\"team\",210/3,400)))))","v":""},null,"",{"$f":"IF(T65=\"\",IF(L65=\"Belt & age\",IF(V65=\"\",IF(E65=\"m\",\"Boys \"&VLOOKUP(G65,INFO!B$19:C$27,2,0),\"Girls \"&VLOOKUP(G65,INFO!B$47:C$55,2,0)),V65),IF(L65=\"weight\",\"\",V65)),IF(J65=\"Team\",W65,IF(T65<14,\"Children\",IF(T65<16,\"Cadet\",IF(T65<18,\"Junior\",IF(T65<21,\"Under 21\",IF(T65<40,\"Senior\",\"Veterans\"))))&\" Opens\")))","v":""},""]
["",{"$f":"IF(C66=\"\",\"\",IF(C66=C65,B65,IF(MATCH(C66,C$1:C$71,0)>=(ROW()-51),MAX(B$1:B65)+1,INDIRECT(\"b\"&(MATCH(C66,C$1:C$71,0)+51),1))))","v":""},null,null,null,"",null,{"$f":"IF(F66=\"\",\"\",IF(F66<=13,\"Children\",IF(F66<=15,\"Cadet\",IF(F66<=17,\"Junior\",\"Senior\"))))","v":""},"",null,null,null,null,null,"","",{"$f":"IF(C66=\"\",\"\",IF(J66=\"Team\",\"Team\",IF(COUNTIF($C$22:$C$103,C66)-COUNTIFS($C$22:$C$103,C66,$J$22:$J$103,\"Team\")>COUNTIF($C$22:$C66,C66)-COUNTIFS($C$22:$C66,C66,$J$22:$J66,\"Team\"),\"\",COUNTIF($C$22:$C$103,C66)-COUNTIFS($C$22:$C$103,C66,$J$22:$J$103,\"Team\"))))","v":""},{"$f":"IF(Q66=\"\",\"\",IF(Q66=1,150,IF(Q66=2,250,IF(Q66=3,350,IF(Q66=\"team\",210/3,400)))))","v":""},null,"",{"$f":"IF(T66=\"\",IF(L66=\"Belt & age\",IF(V66=\"\",IF(E66=\"m\",\"Boys \"&VLOOKUP(G66,INFO!B$19:C$27,2,0),\"Girls \"&VLOOKUP(G66,INFO!B$47:C$55,2,0)),V66),IF(L66=\"weight\",\"\",V66)),IF(J66=\"Team\",W66,IF(T66<14,\"Children\",IF(T66<16,\"Cadet\",IF(T66<18,\"Junior\",IF(T66<21,\"Under 21\",IF(T66<40,\"Senior\",\"Veterans\"))))&\" Opens\")))","v":""},""]
["",{"$f":"IF(C67=\"\",\"\",IF(C67=C66,B66,IF(MATCH(C67,C$1:C$71,0)>=(ROW()-51),MAX(B$1:B66)+1,INDIRECT(\"b\"&(MATCH(C67,C$1:C$71,0)+51),1))))","v":""},null,null,null,"",null,{"$f":"IF(F67=\"\",\"\",IF(F67<=13,\"Children\",IF(F67<=15,\"Cadet\",IF(F67<=17,\"Junior\",\"Senior\"))))","v":""},"",null,null,null,null,null,"","",{"$f":"IF(C67=\"\",\"\",IF(J67=\"Team\",\"Team\",IF(COUNTIF($C$22:$C$103,C67)-COUNTIFS($C$22:$C$103,C67,$J$22:$J$103,\"Team\")>COUNTIF($C$22:$C67,C67)-COUNTIFS($C$22:$C67,C67,$J$22:$J67,\"Team\"),\"\",COUNTIF($C$22:$C$103,C67)-COUNTIFS($C$22:$C$103,C67,$J$22:$J$103,\"Team\"))))","v":""},{"$f":"IF(Q67=\"\",\"\",IF(Q67=1,150,IF(Q67=2,250,IF(Q67=3,350,IF(Q67=\"team\",210/3,400)))))","v":""},null,"",{"$f":"IF(T67=\"\",IF(L67=\"Belt & age\",IF(V67=\"\",IF(E67=\"m\",\"Boys \"&VLOOKUP(G67,INFO!B$19:C$27,2,0),\"Girls \"&VLOOKUP(G67,INFO!B$47:C$55,2,0)),V67),IF(L67=\"weight\",\"\",V67)),IF(J67=\"Team\",W67,IF(T67<14,\"Children\",IF(T67<16,\"Cadet\",IF(T67<18,\"Junior\",IF(T67<21,\"Under 21\",IF(T67<40,\"Senior\",\"Veterans\"))))&\" Opens\")))","v":""},""]
["",{"$f":"IF(C68=\"\",\"\",IF(C68=C67,B67,IF(MATCH(C68,C$1:C$71,0)>=(ROW()-51),MAX(B$1:B67)+1,INDIRECT(\"b\"&(MATCH(C68,C$1:C$71,0)+51),1))))","v":""},null,null,null,"",null,{"$f":"IF(F68=\"\",\"\",IF(F68<=13,\"Children\",IF(F68<=15,\"Cadet\",IF(F68<=17,\"Junior\",\"Senior\"))))","v":""},"",null,null,null,null,null,"","",{"$f":"IF(C68=\"\",\"\",IF(J68=\"Team\",\"Team\",IF(COUNTIF($C$22:$C$103,C68)-COUNTIFS($C$22:$C$103,C68,$J$22:$J$103,\"Team\")>COUNTIF($C$22:$C68,C68)-COUNTIFS($C$22:$C68,C68,$J$22:$J68,\"Team\"),\"\",COUNTIF($C$22:$C$103,C68)-COUNTIFS($C$22:$C$103,C68,$J$22:$J$103,\"Team\"))))","v":""},{"$f":"IF(Q68=\"\",\"\",IF(Q68=1,150,IF(Q68=2,250,IF(Q68=3,350,IF(Q68=\"team\",210/3,400)))))","v":""},null,"",{"$f":"IF(T68=\"\",IF(L68=\"Belt & age\",IF(V68=\"\",IF(E68=\"m\",\"Boys \"&VLOOKUP(G68,INFO!B$19:C$27,2,0),\"Girls \"&VLOOKUP(G68,INFO!B$47:C$55,2,0)),V68),IF(L68=\"weight\",\"\",V68)),IF(J68=\"Team\",W68,IF(T68<14,\"Children\",IF(T68<16,\"Cadet\",IF(T68<18,\"Junior\",IF(T68<21,\"Under 21\",IF(T68<40,\"Senior\",\"Veterans\"))))&\" Opens\")))","v":""},""]
["",{"$f":"IF(C69=\"\",\"\",IF(C69=C68,B68,IF(MATCH(C69,C$1:C$71,0)>=(ROW()-51),MAX(B$1:B68)+1,INDIRECT(\"b\"&(MATCH(C69,C$1:C$71,0)+51),1))))","v":""},null,null,null,"",null,{"$f":"IF(F69=\"\",\"\",IF(F69<=13,\"Children\",IF(F69<=15,\"Cadet\",IF(F69<=17,\"Junior\",\"Senior\"))))","v":""},"",null,null,null,null,null,"","",{"$f":"IF(C69=\"\",\"\",IF(J69=\"Team\",\"Team\",IF(COUNTIF($C$22:$C$103,C69)-COUNTIFS($C$22:$C$103,C69,$J$22:$J$103,\"Team\")>COUNTIF($C$22:$C69,C69)-COUNTIFS($C$22:$C69,C69,$J$22:$J69,\"Team\"),\"\",COUNTIF($C$22:$C$103,C69)-COUNTIFS($C$22:$C$103,C69,$J$22:$J$103,\"Team\"))))","v":""},{"$f":"IF(Q69=\"\",\"\",IF(Q69=1,150,IF(Q69=2,250,IF(Q69=3,350,IF(Q69=\"team\",210/3,400)))))","v":""},null,"",{"$f":"IF(T69=\"\",IF(L69=\"Belt & age\",IF(V69=\"\",IF(E69=\"m\",\"Boys \"&VLOOKUP(G69,INFO!B$19:C$27,2,0),\"Girls \"&VLOOKUP(G69,INFO!B$47:C$55,2,0)),V69),IF(L69=\"weight\",\"\",V69)),IF(J69=\"Team\",W69,IF(T69<14,\"Children\",IF(T69<16,\"Cadet\",IF(T69<18,\"Junior\",IF(T69<21,\"Under 21\",IF(T69<40,\"Senior\",\"Veterans\"))))&\" Opens\")))","v":""},""]
["",{"$f":"IF(C70=\"\",\"\",IF(C70=C69,B69,IF(MATCH(C70,C$1:C$71,0)>=(ROW()-51),MAX(B$1:B69)+1,INDIRECT(\"b\"&(MATCH(C70,C$1:C$71,0)+51),1))))","v":""},null,null,null,"",null,{"$f":"IF(F70=\"\",\"\",IF(F70<=13,\"Children\",IF(F70<=15,\"Cadet\",IF(F70<=17,\"Junior\",\"Senior\"))))","v":""},"",null,null,null,null,null,"","",{"$f":"IF(C70=\"\",\"\",IF(J70=\"Team\",\"Team\",IF(COUNTIF($C$22:$C$103,C70)-COUNTIFS($C$22:$C$103,C70,$J$22:$J$103,\"Team\")>COUNTIF($C$22:$C70,C70)-COUNTIFS($C$22:$C70,C70,$J$22:$J70,\"Team\"),\"\",COUNTIF($C$22:$C$103,C70)-COUNTIFS($C$22:$C$103,C70,$J$22:$J$103,\"Team\"))))","v":""},{"$f":"IF(Q70=\"\",\"\",IF(Q70=1,150,IF(Q70=2,250,IF(Q70=3,350,IF(Q70=\"team\",210/3,400)))))","v":""},null,"",{"$f":"IF(T70=\"\",IF(L70=\"Belt & age\",IF(V70=\"\",IF(E70=\"m\",\"Boys \"&VLOOKUP(G70,INFO!B$19:C$27,2,0),\"Girls \"&VLOOKUP(G70,INFO!B$47:C$55,2,0)),V70),IF(L70=\"weight\",\"\",V70)),IF(J70=\"Team\",W70,IF(T70<14,\"Children\",IF(T70<16,\"Cadet\",IF(T70<18,\"Junior\",IF(T70<21,\"Under 21\",IF(T70<40,\"Senior\",\"Veterans\"))))&\" Opens\")))","v":""},""]
["",{"$f":"IF(C71=\"\",\"\",IF(C71=C70,B70,IF(MATCH(C71,C$1:C$71,0)>=(ROW()-51),MAX(B$1:B70)+1,INDIRECT(\"b\"&(MATCH(C71,C$1:C$71,0)+51),1))))","v":""},null,null,null,"",null,{"$f":"IF(F71=\"\",\"\",IF(F71<=13,\"Children\",IF(F71<=15,\"Cadet\",IF(F71<=17,\"Junior\",\"Senior\"))))","v":""},"",null,null,null,null,null,"","",{"$f":"IF(C71=\"\",\"\",IF(J71=\"Team\",\"Team\",IF(COUNTIF($C$22:$C$103,C71)-COUNTIFS($C$22:$C$103,C71,$J$22:$J$103,\"Team\")>COUNTIF($C$22:$C71,C71)-COUNTIFS($C$22:$C71,C71,$J$22:$J71,\"Team\"),\"\",COUNTIF($C$22:$C$103,C71)-COUNTIFS($C$22:$C$103,C71,$J$22:$J$103,\"Team\"))))","v":""},{"$f":"IF(Q71=\"\",\"\",IF(Q71=1,150,IF(Q71=2,250,IF(Q71=3,350,IF(Q71=\"team\",210/3,400)))))","v":""},null,"",{"$f":"IF(T71=\"\",IF(L71=\"Belt & age\",IF(V71=\"\",IF(E71=\"m\",\"Boys \"&VLOOKUP(G71,INFO!B$19:C$27,2,0),\"Girls \"&VLOOKUP(G71,INFO!B$47:C$55,2,0)),V71),IF(L71=\"weight\",\"\",V71)),IF(J71=\"Team\",W71,IF(T71<14,\"Children\",IF(T71<16,\"Cadet\",IF(T71<18,\"Junior\",IF(T71<21,\"Under 21\",IF(T71<40,\"Senior\",\"Veterans\"))))&\" Opens\")))","v":""},""]
["",{"$f":"IF(C72=\"\",\"\",IF(C72=C71,B71,IF(MATCH(C72,C$1:C$71,0)>=(ROW()-51),MAX(B$1:B71)+1,INDIRECT(\"b\"&(MATCH(C72,C$1:C$71,0)+51),1))))","v":""},null,null,null,"",null,{"$f":"IF(F72=\"\",\"\",IF(F72<=13,\"Children\",IF(F72<=15,\"Cadet\",IF(F72<=17,\"Junior\",\"Senior\"))))","v":""},"",null,null,null,null,null,"","",{"$f":"IF(C72=\"\",\"\",IF(J72=\"Team\",\"Team\",IF(COUNTIF($C$22:$C$103,C72)-COUNTIFS($C$22:$C$103,C72,$J$22:$J$103,\"Team\")>COUNTIF($C$22:$C72,C72)-COUNTIFS($C$22:$C72,C72,$J$22:$J72,\"Team\"),\"\",COUNTIF($C$22:$C$103,C72)-COUNTIFS($C$22:$C$103,C72,$J$22:$J$103,\"Team\"))))","v":""},{"$f":"IF(Q72=\"\",\"\",IF(Q72=1,150,IF(Q72=2,250,IF(Q72=3,350,IF(Q72=\"team\",210/3,400)))))","v":""},null,"",{"$f":"IF(T72=\"\",IF(L72=\"Belt & age\",IF(V72=\"\",IF(E72=\"m\",\"Boys \"&VLOOKUP(G72,INFO!B$19:C$27,2,0),\"Girls \"&VLOOKUP(G72,INFO!B$47:C$55,2,0)),V72),IF(L72=\"weight\",\"\",V72)),IF(J72=\"Team\",W72,IF(T72<14,\"Children\",IF(T72<16,\"Cadet\",IF(T72<18,\"Junior\",IF(T72<21,\"Under 21\",IF(T72<40,\"Senior\",\"Veterans\"))))&\" Opens\")))","v":""},""]
["",{"$f":"IF(C73=\"\",\"\",IF(C73=C72,B72,IF(MATCH(C73,C$1:C$71,0)>=(ROW()-51),MAX(B$1:B72)+1,INDIRECT(\"b\"&(MATCH(C73,C$1:C$71,0)+51),1))))","v":""},null,null,null,"",null,{"$f":"IF(F73=\"\",\"\",IF(F73<=13,\"Children\",IF(F73<=15,\"Cadet\",IF(F73<=17,\"Junior\",\"Senior\"))))","v":""},"",null,null,null,null,null,"","",{"$f":"IF(C73=\"\",\"\",IF(J73=\"Team\",\"Team\",IF(COUNTIF($C$22:$C$103,C73)-COUNTIFS($C$22:$C$103,C73,$J$22:$J$103,\"Team\")>COUNTIF($C$22:$C73,C73)-COUNTIFS($C$22:$C73,C73,$J$22:$J73,\"Team\"),\"\",COUNTIF($C$22:$C$103,C73)-COUNTIFS($C$22:$C$103,C73,$J$22:$J$103,\"Team\"))))","v":""},{"$f":"IF(Q73=\"\",\"\",IF(Q73=1,150,IF(Q73=2,250,IF(Q73=3,350,IF(Q73=\"team\",210/3,400)))))","v":""},null,"",{"$f":"IF(T73=\"\",IF(L73=\"Belt & age\",IF(V73=\"\",IF(E73=\"m\",\"Boys \"&VLOOKUP(G73,INFO!B$19:C$27,2,0),\"Girls \"&VLOOKUP(G73,INFO!B$47:C$55,2,0)),V73),IF(L73=\"weight\",\"\",V73)),IF(J73=\"Team\",W73,IF(T73<14,\"Children\",IF(T73<16,\"Cadet\",IF(T73<18,\"Junior\",IF(T73<21,\"Under 21\",IF(T73<40,\"Senior\",\"Veterans\"))))&\" Opens\")))","v":""},""]
["",{"$f":"IF(C74=\"\",\"\",IF(C74=C73,B73,IF(MATCH(C74,C$1:C$71,0)>=(ROW()-51),MAX(B$1:B73)+1,INDIRECT(\"b\"&(MATCH(C74,C$1:C$71,0)+51),1))))","v":""},null,null,null,"",null,{"$f":"IF(F74=\"\",\"\",IF(F74<=13,\"Children\",IF(F74<=15,\"Cadet\",IF(F74<=17,\"Junior\",\"Senior\"))))","v":""},"",null,null,null,null,null,"","",{"$f":"IF(C74=\"\",\"\",IF(J74=\"Team\",\"Team\",IF(COUNTIF($C$22:$C$103,C74)-COUNTIFS($C$22:$C$103,C74,$J$22:$J$103,\"Team\")>COUNTIF($C$22:$C74,C74)-COUNTIFS($C$22:$C74,C74,$J$22:$J74,\"Team\"),\"\",COUNTIF($C$22:$C$103,C74)-COUNTIFS($C$22:$C$103,C74,$J$22:$J$103,\"Team\"))))","v":""},{"$f":"IF(Q74=\"\",\"\",IF(Q74=1,150,IF(Q74=2,250,IF(Q74=3,350,IF(Q74=\"team\",210/3,400)))))","v":""},null,"",{"$f":"IF(T74=\"\",IF(L74=\"Belt & age\",IF(V74=\"\",IF(E74=\"m\",\"Boys \"&VLOOKUP(G74,INFO!B$19:C$27,2,0),\"Girls \"&VLOOKUP(G74,INFO!B$47:C$55,2,0)),V74),IF(L74=\"weight\",\"\",V74)),IF(J74=\"Team\",W74,IF(T74<14,\"Children\",IF(T74<16,\"Cadet\",IF(T74<18,\"Junior\",IF(T74<21,\"Under 21\",IF(T74<40,\"Senior\",\"Veterans\"))))&\" Opens\")))","v":""},""]
["",{"$f":"IF(C75=\"\",\"\",IF(C75=C74,B74,IF(MATCH(C75,C$1:C$71,0)>=(ROW()-51),MAX(B$1:B74)+1,INDIRECT(\"b\"&(MATCH(C75,C$1:C$71,0)+51),1))))","v":""},null,null,null,"",null,{"$f":"IF(F75=\"\",\"\",IF(F75<=13,\"Children\",IF(F75<=15,\"Cadet\",IF(F75<=17,\"Junior\",\"Senior\"))))","v":""},"",null,null,null,null,null,"","",{"$f":"IF(C75=\"\",\"\",IF(J75=\"Team\",\"Team\",IF(COUNTIF($C$22:$C$103,C75)-COUNTIFS($C$22:$C$103,C75,$J$22:$J$103,\"Team\")>COUNTIF($C$22:$C75,C75)-COUNTIFS($C$22:$C75,C75,$J$22:$J75,\"Team\"),\"\",COUNTIF($C$22:$C$103,C75)-COUNTIFS($C$22:$C$103,C75,$J$22:$J$103,\"Team\"))))","v":""},{"$f":"IF(Q75=\"\",\"\",IF(Q75=1,150,IF(Q75=2,250,IF(Q75=3,350,IF(Q75=\"team\",210/3,400)))))","v":""},null,"",{"$f":"IF(T75=\"\",IF(L75=\"Belt & age\",IF(V75=\"\",IF(E75=\"m\",\"Boys \"&VLOOKUP(G75,INFO!B$19:C$27,2,0),\"Girls \"&VLOOKUP(G75,INFO!B$47:C$55,2,0)),V75),IF(L75=\"weight\",\"\",V75)),IF(J75=\"Team\",W75,IF(T75<14,\"Children\",IF(T75<16,\"Cadet\",IF(T75<18,\"Junior\",IF(T75<21,\"Under 21\",IF(T75<40,\"Senior\",\"Veterans\"))))&\" Opens\")))","v":""},""]
["",{"$f":"IF(C76=\"\",\"\",IF(C76=C75,B75,IF(MATCH(C76,C$1:C$71,0)>=(ROW()-51),MAX(B$1:B75)+1,INDIRECT(\"b\"&(MATCH(C76,C$1:C$71,0)+51),1))))","v":""},null,null,null,"",null,{"$f":"IF(F76=\"\",\"\",IF(F76<=13,\"Children\",IF(F76<=15,\"Cadet\",IF(F76<=17,\"Junior\",\"Senior\"))))","v":""},"",null,null,null,null,null,"","",{"$f":"IF(C76=\"\",\"\",IF(J76=\"Team\",\"Team\",IF(COUNTIF($C$22:$C$103,C76)-COUNTIFS($C$22:$C$103,C76,$J$22:$J$103,\"Team\")>COUNTIF($C$22:$C76,C76)-COUNTIFS($C$22:$C76,C76,$J$22:$J76,\"Team\"),\"\",COUNTIF($C$22:$C$103,C76)-COUNTIFS($C$22:$C$103,C76,$J$22:$J$103,\"Team\"))))","v":""},{"$f":"IF(Q76=\"\",\"\",IF(Q76=1,150,IF(Q76=2,250,IF(Q76=3,350,IF(Q76=\"team\",210/3,400)))))","v":""},null,"",{"$f":"IF(T76=\"\",IF(L76=\"Belt & age\",IF(V76=\"\",IF(E76=\"m\",\"Boys \"&VLOOKUP(G76,INFO!B$19:C$27,2,0),\"Girls \"&VLOOKUP(G76,INFO!B$47:C$55,2,0)),V76),IF(L76=\"weight\",\"\",V76)),IF(J76=\"Team\",W76,IF(T76<14,\"Children\",IF(T76<16,\"Cadet\",IF(T76<18,\"Junior\",IF(T76<21,\"Under 21\",IF(T76<40,\"Senior\",\"Veterans\"))))&\" Opens\")))","v":""},""]
["",{"$f":"IF(C77=\"\",\"\",IF(C77=C76,B76,IF(MATCH(C77,C$1:C$71,0)>=(ROW()-51),MAX(B$1:B76)+1,INDIRECT(\"b\"&(MATCH(C77,C$1:C$71,0)+51),1))))","v":""},null,null,null,"",null,{"$f":"IF(F77=\"\",\"\",IF(F77<=13,\"Children\",IF(F77<=15,\"Cadet\",IF(F77<=17,\"Junior\",\"Senior\"))))","v":""},"",null,null,null,null,null,"","",{"$f":"IF(C77=\"\",\"\",IF(J77=\"Team\",\"Team\",IF(COUNTIF($C$22:$C$103,C77)-COUNTIFS($C$22:$C$103,C77,$J$22:$J$103,\"Team\")>COUNTIF($C$22:$C77,C77)-COUNTIFS($C$22:$C77,C77,$J$22:$J77,\"Team\"),\"\",COUNTIF($C$22:$C$103,C77)-COUNTIFS($C$22:$C$103,C77,$J$22:$J$103,\"Team\"))))","v":""},{"$f":"IF(Q77=\"\",\"\",IF(Q77=1,150,IF(Q77=2,250,IF(Q77=3,350,IF(Q77=\"team\",210/3,400)))))","v":""},null,"",{"$f":"IF(T77=\"\",IF(L77=\"Belt & age\",IF(V77=\"\",IF(E77=\"m\",\"Boys \"&VLOOKUP(G77,INFO!B$19:C$27,2,0),\"Girls \"&VLOOKUP(G77,INFO!B$47:C$55,2,0)),V77),IF(L77=\"weight\",\"\",V77)),IF(J77=\"Team\",W77,IF(T77<14,\"Children\",IF(T77<16,\"Cadet\",IF(T77<18,\"Junior\",IF(T77<21,\"Under 21\",IF(T77<40,\"Senior\",\"Veterans\"))))&\" Opens\")))","v":""},""]
["",{"$f":"IF(C78=\"\",\"\",IF(C78=C77,B77,IF(MATCH(C78,C$1:C$71,0)>=(ROW()-51),MAX(B$1:B77)+1,INDIRECT(\"b\"&(MATCH(C78,C$1:C$71,0)+51),1))))","v":""},null,null,null,"",null,{"$f":"IF(F78=\"\",\"\",IF(F78<=13,\"Children\",IF(F78<=15,\"Cadet\",IF(F78<=17,\"Junior\",\"Senior\"))))","v":""},"",null,null,null,null,null,"","",{"$f":"IF(C78=\"\",\"\",IF(J78=\"Team\",\"Team\",IF(COUNTIF($C$22:$C$103,C78)-COUNTIFS($C$22:$C$103,C78,$J$22:$J$103,\"Team\")>COUNTIF($C$22:$C78,C78)-COUNTIFS($C$22:$C78,C78,$J$22:$J78,\"Team\"),\"\",COUNTIF($C$22:$C$103,C78)-COUNTIFS($C$22:$C$103,C78,$J$22:$J$103,\"Team\"))))","v":""},{"$f":"IF(Q78=\"\",\"\",IF(Q78=1,150,IF(Q78=2,250,IF(Q78=3,350,IF(Q78=\"team\",210/3,400)))))","v":""},null,"",{"$f":"IF(T78=\"\",IF(L78=\"Belt & age\",IF(V78=\"\",IF(E78=\"m\",\"Boys \"&VLOOKUP(G78,INFO!B$19:C$27,2,0),\"Girls \"&VLOOKUP(G78,INFO!B$47:C$55,2,0)),V78),IF(L78=\"weight\",\"\",V78)),IF(J78=\"Team\",W78,IF(T78<14,\"Children\",IF(T78<16,\"Cadet\",IF(T78<18,\"Junior\",IF(T78<21,\"Under 21\",IF(T78<40,\"Senior\",\"Veterans\"))))&\" Opens\")))","v":""},""]
["",{"$f":"IF(C79=\"\",\"\",IF(C79=C78,B78,IF(MATCH(C79,C$1:C$71,0)>=(ROW()-51),MAX(B$1:B78)+1,INDIRECT(\"b\"&(MATCH(C79,C$1:C$71,0)+51),1))))","v":""},null,null,null,"",null,{"$f":"IF(F79=\"\",\"\",IF(F79<=13,\"Children\",IF(F79<=15,\"Cadet\",IF(F79<=17,\"Junior\",\"Senior\"))))","v":""},"",null,null,null,null,null,"","",{"$f":"IF(C79=\"\",\"\",IF(J79=\"Team\",\"Team\",IF(COUNTIF($C$22:$C$103,C79)-COUNTIFS($C$22:$C$103,C79,$J$22:$J$103,\"Team\")>COUNTIF($C$22:$C79,C79)-COUNTIFS($C$22:$C79,C79,$J$22:$J79,\"Team\"),\"\",COUNTIF($C$22:$C$103,C79)-COUNTIFS($C$22:$C$103,C79,$J$22:$J$103,\"Team\"))))","v":""},{"$f":"IF(Q79=\"\",\"\",IF(Q79=1,150,IF(Q79=2,250,IF(Q79=3,350,IF(Q79=\"team\",210/3,400)))))","v":""},null,"",{"$f":"IF(T79=\"\",IF(L79=\"Belt & age\",IF(V79=\"\",IF(E79=\"m\",\"Boys \"&VLOOKUP(G79,INFO!B$19:C$27,2,0),\"Girls \"&VLOOKUP(G79,INFO!B$47:C$55,2,0)),V79),IF(L79=\"weight\",\"\",V79)),IF(J79=\"Team\",W79,IF(T79<14,\"Children\",IF(T79<16,\"Cadet\",IF(T79<18,\"Junior\",IF(T79<21,\"Under 21\",IF(T79<40,\"Senior\",\"Veterans\"))))&\" Opens\")))","v":""},""]
["",{"$f":"IF(C80=\"\",\"\",IF(C80=C79,B79,IF(MATCH(C80,C$1:C$71,0)>=(ROW()-51),MAX(B$1:B79)+1,INDIRECT(\"b\"&(MATCH(C80,C$1:C$71,0)+51),1))))","v":""},null,null,null,{"$f":"IF(D80=\"\",\"\",IF(MONTH($Q$1)>=MONTH(D80),IF(MONTH($Q$1)=MONTH(D80),IF(DAY($Q$1)>=DAY(D80),YEAR($Q$1)-YEAR(D80),YEAR($Q$1)-YEAR(D80)-1),YEAR($Q$1)-YEAR(D80)),YEAR($Q$1)-YEAR(D80)-1))","v":""},null,{"$f":"IF(F80=\"\",\"\",IF(F80<=13,\"Children\",IF(F80<=15,\"Cadet\",IF(F80<=17,\"Junior\",\"Senior\"))))","v":""},"",null,null,null,null,null,"","",{"$f":"IF(C80=\"\",\"\",IF(J80=\"Team\",\"Team\",IF(COUNTIF($C$22:$C$103,C80)-COUNTIFS($C$22:$C$103,C80,$J$22:$J$103,\"Team\")>COUNTIF($C$22:$C80,C80)-COUNTIFS($C$22:$C80,C80,$J$22:$J80,\"Team\"),\"\",COUNTIF($C$22:$C$103,C80)-COUNTIFS($C$22:$C$103,C80,$J$22:$J$103,\"Team\"))))","v":""},{"$f":"IF(Q80=\"\",\"\",IF(Q80=1,150,IF(Q80=2,250,IF(Q80=3,350,IF(Q80=\"team\",210/3,400)))))","v":""},null,{"$f":"IF(L80=\"Open *\",IF(D80=\"\",\"\",IF(MONTH($Q$2)>=MONTH(D80),IF(MONTH($Q$2)=MONTH(D80),IF(DAY($Q$2)>=DAY(D80),YEAR($Q$2)-YEAR(D80),YEAR($Q$2)-YEAR(D80)-1),YEAR($Q$2)-YEAR(D80)),YEAR($Q$2)-YEAR(D80)-1)),\"\")","v":""},{"$f":"IF(T80=\"\",IF(L80=\"Belt & age\",IF(V80=\"\",IF(E80=\"m\",\"Boys \"&VLOOKUP(G80,INFO!B$19:C$27,2,0),\"Girls \"&VLOOKUP(G80,INFO!B$47:C$55,2,0)),V80),IF(L80=\"weight\",\"\",V80)),IF(J80=\"Team\",W80,IF(T80<14,\"Children\",IF(T80<16,\"Cadet\",IF(T80<18,\"Junior\",IF(T80<21,\"Under 21\",IF(T80<40,\"Senior\",\"Veterans\"))))&\" Opens\")))","v":""},""]
["",{"$f":"IF(C81=\"\",\"\",IF(C81=C80,B80,IF(MATCH(C81,C$1:C$71,0)>=(ROW()-51),MAX(B$1:B80)+1,INDIRECT(\"b\"&(MATCH(C81,C$1:C$71,0)+51),1))))","v":""},null,null,null,"",null,{"$f":"IF(F81=\"\",\"\",IF(F81<=13,\"Children\",IF(F81<=15,\"Cadet\",IF(F81<=17,\"Junior\",\"Senior\"))))","v":""},"",null,null,null,null,null,{"$f":"IF(J81=\"Individual\",IF(K81=\"Kata\",\"X\",IF(K81=\"Superkata\",\"S\",\"\")),IF(K81=\"kata\",\"T\",\"\"))","v":""},{"$f":"IF(J81=\"Individual\",IF(K81=\"Kumite\",\"X\",\"\"),IF(K81=\"kumite\",\"T\",\"\"))","v":""},{"$f":"IF(C81=\"\",\"\",IF(J81=\"Team\",\"Team\",IF(COUNTIF($C$22:$C$103,C81)-COUNTIFS($C$22:$C$103,C81,$J$22:$J$103,\"Team\")>COUNTIF($C$22:$C81,C81)-COUNTIFS($C$22:$C81,C81,$J$22:$J81,\"Team\"),\"\",COUNTIF($C$22:$C$103,C81)-COUNTIFS($C$22:$C$103,C81,$J$22:$J$103,\"Team\"))))","v":""},{"$f":"IF(Q81=\"\",\"\",IF(Q81=1,150,IF(Q81=2,250,IF(Q81=3,350,IF(Q81=\"team\",210/3,400)))))","v":""},null,"",{"$f":"IF(T81=\"\",IF(L81=\"Belt & age\",IF(V81=\"\",IF(E81=\"m\",\"Boys \"&VLOOKUP(G81,INFO!B$19:C$27,2,0),\"Girls \"&VLOOKUP(G81,INFO!B$47:C$55,2,0)),V81),IF(L81=\"weight\",\"\",V81)),IF(J81=\"Team\",W81,IF(T81<14,\"Children\",IF(T81<16,\"Cadet\",IF(T81<18,\"Junior\",IF(T81<21,\"Under 21\",IF(T81<40,\"Senior\",\"Veterans\"))))&\" Opens\")))","v":""},""]
["",{"$f":"IF(C82=\"\",\"\",IF(C82=C81,B81,IF(MATCH(C82,C$1:C$71,0)>=(ROW()-51),MAX(B$1:B81)+1,INDIRECT(\"b\"&(MATCH(C82,C$1:C$71,0)+51),1))))","v":""},null,null,null,"",null,{"$f":"IF(F82=\"\",\"\",IF(F82<=13,\"Children\",IF(F82<=15,\"Cadet\",IF(F82<=17,\"Junior\",\"Senior\"))))","v":""},"",null,null,null,null,null,"","",{"$f":"IF(C82=\"\",\"\",IF(J82=\"Team\",\"Team\",IF(COUNTIF($C$22:$C$103,C82)-COUNTIFS($C$22:$C$103,C82,$J$22:$J$103,\"Team\")>COUNTIF($C$22:$C82,C82)-COUNTIFS($C$22:$C82,C82,$J$22:$J82,\"Team\"),\"\",COUNTIF($C$22:$C$103,C82)-COUNTIFS($C$22:$C$103,C82,$J$22:$J$103,\"Team\"))))","v":""},{"$f":"IF(Q82=\"\",\"\",IF(Q82=1,150,IF(Q82=2,250,IF(Q82=3,350,IF(Q82=\"team\",210/3,400)))))","v":""},null,"",{"$f":"IF(T82=\"\",IF(L82=\"Belt & age\",IF(V82=\"\",IF(E82=\"m\",\"Boys \"&VLOOKUP(G82,INFO!B$19:C$27,2,0),\"Girls \"&VLOOKUP(G82,INFO!B$47:C$55,2,0)),V82),IF(L82=\"weight\",\"\",V82)),IF(J82=\"Team\",W82,IF(T82<14,\"Children\",IF(T82<16,\"Cadet\",IF(T82<18,\"Junior\",IF(T82<21,\"Under 21\",IF(T82<40,\"Senior\",\"Veterans\"))))&\" Opens\")))","v":""},""]
["",{"$f":"IF(C83=\"\",\"\",IF(C83=C82,B82,IF(MATCH(C83,C$1:C$71,0)>=(ROW()-51),MAX(B$1:B82)+1,INDIRECT(\"b\"&(MATCH(C83,C$1:C$71,0)+51),1))))","v":""},null,null,null,"",null,{"$f":"IF(F83=\"\",\"\",IF(F83<=13,\"Children\",IF(F83<=15,\"Cadet\",IF(F83<=17,\"Junior\",\"Senior\"))))","v":""},"",null,null,null,null,null,"","",{"$f":"IF(C83=\"\",\"\",IF(J83=\"Team\",\"Team\",IF(COUNTIF($C$22:$C$103,C83)-COUNTIFS($C$22:$C$103,C83,$J$22:$J$103,\"Team\")>COUNTIF($C$22:$C83,C83)-COUNTIFS($C$22:$C83,C83,$J$22:$J83,\"Team\"),\"\",COUNTIF($C$22:$C$103,C83)-COUNTIFS($C$22:$C$103,C83,$J$22:$J$103,\"Team\"))))","v":""},{"$f":"IF(Q83=\"\",\"\",IF(Q83=1,150,IF(Q83=2,250,IF(Q83=3,350,IF(Q83=\"team\",210/3,400)))))","v":""},null,"",{"$f":"IF(T83=\"\",IF(L83=\"Belt & age\",IF(V83=\"\",IF(E83=\"m\",\"Boys \"&VLOOKUP(G83,INFO!B$19:C$27,2,0),\"Girls \"&VLOOKUP(G83,INFO!B$47:C$55,2,0)),V83),IF(L83=\"weight\",\"\",V83)),IF(J83=\"Team\",W83,IF(T83<14,\"Children\",IF(T83<16,\"Cadet\",IF(T83<18,\"Junior\",IF(T83<21,\"Under 21\",IF(T83<40,\"Senior\",\"Veterans\"))))&\" Opens\")))","v":""},""]
["",{"$f":"IF(C84=\"\",\"\",IF(C84=C83,B83,IF(MATCH(C84,C$1:C$71,0)>=(ROW()-51),MAX(B$1:B83)+1,INDIRECT(\"b\"&(MATCH(C84,C$1:C$71,0)+51),1))))","v":""},null,null,null,"",null,{"$f":"IF(F84=\"\",\"\",IF(F84<=13,\"Children\",IF(F84<=15,\"Cadet\",IF(F84<=17,\"Junior\",\"Senior\"))))","v":""},"",null,null,null,null,null,"","",{"$f":"IF(C84=\"\",\"\",IF(J84=\"Team\",\"Team\",IF(COUNTIF($C$22:$C$103,C84)-COUNTIFS($C$22:$C$103,C84,$J$22:$J$103,\"Team\")>COUNTIF($C$22:$C84,C84)-COUNTIFS($C$22:$C84,C84,$J$22:$J84,\"Team\"),\"\",COUNTIF($C$22:$C$103,C84)-COUNTIFS($C$22:$C$103,C84,$J$22:$J$103,\"Team\"))))","v":""},{"$f":"IF(Q84=\"\",\"\",IF(Q84=1,150,IF(Q84=2,250,IF(Q84=3,350,IF(Q84=\"team\",210/3,400)))))","v":""},null,"",{"$f":"IF(T84=\"\",IF(L84=\"Belt & age\",IF(V84=\"\",IF(E84=\"m\",\"Boys \"&VLOOKUP(G84,INFO!B$19:C$27,2,0),\"Girls \"&VLOOKUP(G84,INFO!B$47:C$55,2,0)),V84),IF(L84=\"weight\",\"\",V84)),IF(J84=\"Team\",W84,IF(T84<14,\"Children\",IF(T84<16,\"Cadet\",IF(T84<18,\"Junior\",IF(T84<21,\"Under 21\",IF(T84<40,\"Senior\",\"Veterans\"))))&\" Opens\")))","v":""},""]
["",{"$f":"IF(C85=\"\",\"\",IF(C85=C84,B84,IF(MATCH(C85,C$1:C$71,0)>=(ROW()-51),MAX(B$1:B84)+1,INDIRECT(\"b\"&(MATCH(C85,C$1:C$71,0)+51),1))))","v":""},null,null,null,"",null,{"$f":"IF(F85=\"\",\"\",IF(F85<=13,\"Children\",IF(F85<=15,\"Cadet\",IF(F85<=17,\"Junior\",\"Senior\"))))","v":""},"",null,null,null,null,null,"","",{"$f":"IF(C85=\"\",\"\",IF(J85=\"Team\",\"Team\",IF(COUNTIF($C$22:$C$103,C85)-COUNTIFS($C$22:$C$103,C85,$J$22:$J$103,\"Team\")>COUNTIF($C$22:$C85,C85)-COUNTIFS($C$22:$C85,C85,$J$22:$J85,\"Team\"),\"\",COUNTIF($C$22:$C$103,C85)-COUNTIFS($C$22:$C$103,C85,$J$22:$J$103,\"Team\"))))","v":""},{"$f":"IF(Q85=\"\",\"\",IF(Q85=1,150,IF(Q85=2,250,IF(Q85=3,350,IF(Q85=\"team\",210/3,400)))))","v":""},null,"",{"$f":"IF(T85=\"\",IF(L85=\"Belt & age\",IF(V85=\"\",IF(E85=\"m\",\"Boys \"&VLOOKUP(G85,INFO!B$19:C$27,2,0),\"Girls \"&VLOOKUP(G85,INFO!B$47:C$55,2,0)),V85),IF(L85=\"weight\",\"\",V85)),IF(J85=\"Team\",W85,IF(T85<14,\"Children\",IF(T85<16,\"Cadet\",IF(T85<18,\"Junior\",IF(T85<21,\"Under 21\",IF(T85<40,\"Senior\",\"Veterans\"))))&\" Opens\")))","v":""},""]
["",{"$f":"IF(C86=\"\",\"\",IF(C86=C85,B85,IF(MATCH(C86,C$1:C$71,0)>=(ROW()-51),MAX(B$1:B85)+1,INDIRECT(\"b\"&(MATCH(C86,C$1:C$71,0)+51),1))))","v":""},null,null,null,"",null,{"$f":"IF(F86=\"\",\"\",IF(F86<=13,\"Children\",IF(F86<=15,\"Cadet\",IF(F86<=17,\"Junior\",\"Senior\"))))","v":""},"",null,null,null,null,null,"","",{"$f":"IF(C86=\"\",\"\",IF(J86=\"Team\",\"Team\",IF(COUNTIF($C$22:$C$103,C86)-COUNTIFS($C$22:$C$103,C86,$J$22:$J$103,\"Team\")>COUNTIF($C$22:$C86,C86)-COUNTIFS($C$22:$C86,C86,$J$22:$J86,\"Team\"),\"\",COUNTIF($C$22:$C$103,C86)-COUNTIFS($C$22:$C$103,C86,$J$22:$J$103,\"Team\"))))","v":""},{"$f":"IF(Q86=\"\",\"\",IF(Q86=1,150,IF(Q86=2,250,IF(Q86=3,350,IF(Q86=\"team\",210/3,400)))))","v":""},null,"",{"$f":"IF(T86=\"\",IF(L86=\"Belt & age\",IF(V86=\"\",IF(E86=\"m\",\"Boys \"&VLOOKUP(G86,INFO!B$19:C$27,2,0),\"Girls \"&VLOOKUP(G86,INFO!B$47:C$55,2,0)),V86),IF(L86=\"weight\",\"\",V86)),IF(J86=\"Team\",W86,IF(T86<14,\"Children\",IF(T86<16,\"Cadet\",IF(T86<18,\"Junior\",IF(T86<21,\"Under 21\",IF(T86<40,\"Senior\",\"Veterans\"))))&\" Opens\")))","v":""},""]
[{"$f":"IF(C87=\"\",\"\",A86+1)","v":""},{"$f":"IF(C87=\"\",\"\",IF(C87=C86,B86,IF(MATCH(C87,C$1:C$71,0)>=(ROW()-51),MAX(B$1:B86)+1,INDIRECT(\"b\"&(MATCH(C87,C$1:C$71,0)+51),1))))","v":""},null,null,null,"",null,{"$f":"IF(F87=\"\",\"\",IF(F87<=13,\"Children\",IF(F87<=15,\"Cadet\",IF(F87<=17,\"Junior\",\"Senior\"))))","v":""},"",null,null,null,null,null,"","",{"$f":"IF(C87=\"\",\"\",IF(J87=\"Team\",\"Team\",IF(COUNTIF($C$22:$C$103,C87)-COUNTIFS($C$22:$C$103,C87,$J$22:$J$103,\"Team\")>COUNTIF($C$22:$C87,C87)-COUNTIFS($C$22:$C87,C87,$J$22:$J87,\"Team\"),\"\",COUNTIF($C$22:$C$103,C87)-COUNTIFS($C$22:$C$103,C87,$J$22:$J$103,\"Team\"))))","v":""},{"$f":"IF(Q87=\"\",\"\",IF(Q87=1,150,IF(Q87=2,250,IF(Q87=3,350,IF(Q87=\"team\",210/3,400)))))","v":""},null,"",{"$f":"IF(T87=\"\",IF(L87=\"Belt & age\",IF(V87=\"\",IF(E87=\"m\",\"Boys \"&VLOOKUP(G87,INFO!B$19:C$27,2,0),\"Girls \"&VLOOKUP(G87,INFO!B$47:C$55,2,0)),V87),IF(L87=\"weight\",\"\",V87)),IF(J87=\"Team\",W87,IF(T87<14,\"Children\",IF(T87<16,\"Cadet\",IF(T87<18,\"Junior\",IF(T87<21,\"Under 21\",IF(T87<40,\"Senior\",\"Veterans\"))))&\" Opens\")))","v":""},{"$f":"IF(F87>=14,IF(L87=\"Belt & Age\",IF(G87=\"black\",\"NO SUCH DIVISION!!!\",\"Development\"),\"\"),\"\")","v":""}]
["",{"$f":"IF(C88=\"\",\"\",IF(C88=C87,B87,IF(MATCH(C88,C$1:C$71,0)>=(ROW()-51),MAX(B$1:B87)+1,INDIRECT(\"b\"&(MATCH(C88,C$1:C$71,0)+51),1))))","v":""},null,null,null,"",null,{"$f":"IF(F88=\"\",\"\",IF(F88<=13,\"Children\",IF(F88<=15,\"Cadet\",IF(F88<=17,\"Junior\",\"Senior\"))))","v":""},{"$f":"IF(C88=\"\",\"\",+$D$2)","v":""},null,null,null,null,null,"","",{"$f":"IF(C88=\"\",\"\",IF(J88=\"Team\",\"Team\",IF(COUNTIF($C$22:$C$103,C88)-COUNTIFS($C$22:$C$103,C88,$J$22:$J$103,\"Team\")>COUNTIF($C$22:$C88,C88)-COUNTIFS($C$22:$C88,C88,$J$22:$J88,\"Team\"),\"\",COUNTIF($C$22:$C$103,C88)-COUNTIFS($C$22:$C$103,C88,$J$22:$J$103,\"Team\"))))","v":""},{"$f":"IF(Q88=\"\",\"\",IF(Q88=1,150,IF(Q88=2,250,IF(Q88=3,350,IF(Q88=\"team\",210/3,400)))))","v":""},null,"",{"$f":"IF(T88=\"\",IF(L88=\"Belt & age\",IF(V88=\"\",IF(E88=\"m\",\"Boys \"&VLOOKUP(G88,INFO!B$19:C$27,2,0),\"Girls \"&VLOOKUP(G88,INFO!B$47:C$55,2,0)),V88),IF(L88=\"weight\",\"\",V88)),IF(J88=\"Team\",W88,IF(T88<14,\"Children\",IF(T88<16,\"Cadet\",IF(T88<18,\"Junior\",IF(T88<21,\"Under 21\",IF(T88<40,\"Senior\",\"Veterans\"))))&\" Opens\")))","v":""},""]
["",{"$f":"IF(C89=\"\",\"\",IF(C89=C88,B88,IF(MATCH(C89,C$1:C$71,0)>=(ROW()-51),MAX(B$1:B88)+1,INDIRECT(\"b\"&(MATCH(C89,C$1:C$71,0)+51),1))))","v":""},null,null,null,"",null,{"$f":"IF(F89=\"\",\"\",IF(F89<=13,\"Children\",IF(F89<=15,\"Cadet\",IF(F89<=17,\"Junior\",\"Senior\"))))","v":""},"",null,null,null,null,null,"","",{"$f":"IF(C89=\"\",\"\",IF(J89=\"Team\",\"Team\",IF(COUNTIF($C$22:$C$103,C89)-COUNTIFS($C$22:$C$103,C89,$J$22:$J$103,\"Team\")>COUNTIF($C$22:$C89,C89)-COUNTIFS($C$22:$C89,C89,$J$22:$J89,\"Team\"),\"\",COUNTIF($C$22:$C$103,C89)-COUNTIFS($C$22:$C$103,C89,$J$22:$J$103,\"Team\"))))","v":""},{"$f":"IF(Q89=\"\",\"\",IF(Q89=1,150,IF(Q89=2,250,IF(Q89=3,350,IF(Q89=\"team\",210/3,400)))))","v":""},null,"",{"$f":"IF(T89=\"\",IF(L89=\"Belt & age\",IF(V89=\"\",IF(E89=\"m\",\"Boys \"&VLOOKUP(G89,INFO!B$19:C$27,2,0),\"Girls \"&VLOOKUP(G89,INFO!B$47:C$55,2,0)),V89),IF(L89=\"weight\",\"\",V89)),IF(J89=\"Team\",W89,IF(T89<14,\"Children\",IF(T89<16,\"Cadet\",IF(T89<18,\"Junior\",IF(T89<21,\"Under 21\",IF(T89<40,\"Senior\",\"Veterans\"))))&\" Opens\")))","v":""},""]
["",{"$f":"IF(C90=\"\",\"\",IF(C90=C89,B89,IF(MATCH(C90,C$1:C$71,0)>=(ROW()-51),MAX(B$1:B89)+1,INDIRECT(\"b\"&(MATCH(C90,C$1:C$71,0)+51),1))))","v":""},null,null,null,"",null,{"$f":"IF(F90=\"\",\"\",IF(F90<=13,\"Children\",IF(F90<=15,\"Cadet\",IF(F90<=17,\"Junior\",\"Senior\"))))","v":""},"",null,null,null,null,null,"","",{"$f":"IF(C90=\"\",\"\",IF(J90=\"Team\",\"Team\",IF(COUNTIF($C$22:$C$103,C90)-COUNTIFS($C$22:$C$103,C90,$J$22:$J$103,\"Team\")>COUNTIF($C$22:$C90,C90)-COUNTIFS($C$22:$C90,C90,$J$22:$J90,\"Team\"),\"\",COUNTIF($C$22:$C$103,C90)-COUNTIFS($C$22:$C$103,C90,$J$22:$J$103,\"Team\"))))","v":""},{"$f":"IF(Q90=\"\",\"\",IF(Q90=1,150,IF(Q90=2,250,IF(Q90=3,350,IF(Q90=\"team\",210/3,400)))))","v":""},null,"",{"$f":"IF(T90=\"\",IF(L90=\"Belt & age\",IF(V90=\"\",IF(E90=\"m\",\"Boys \"&VLOOKUP(G90,INFO!B$19:C$27,2,0),\"Girls \"&VLOOKUP(G90,INFO!B$47:C$55,2,0)),V90),IF(L90=\"weight\",\"\",V90)),IF(J90=\"Team\",W90,IF(T90<14,\"Children\",IF(T90<16,\"Cadet\",IF(T90<18,\"Junior\",IF(T90<21,\"Under 21\",IF(T90<40,\"Senior\",\"Veterans\"))))&\" Opens\")))","v":""},""]
["",{"$f":"IF(C91=\"\",\"\",IF(C91=C90,B90,IF(MATCH(C91,C$1:C$71,0)>=(ROW()-51),MAX(B$1:B90)+1,INDIRECT(\"b\"&(MATCH(C91,C$1:C$71,0)+51),1))))","v":""},null,null,null,"",null,{"$f":"IF(F91=\"\",\"\",IF(F91<=13,\"Children\",IF(F91<=15,\"Cadet\",IF(F91<=17,\"Junior\",\"Senior\"))))","v":""},"",null,null,null,null,null,"","",{"$f":"IF(C91=\"\",\"\",IF(J91=\"Team\",\"Team\",IF(COUNTIF($C$22:$C$103,C91)-COUNTIFS($C$22:$C$103,C91,$J$22:$J$103,\"Team\")>COUNTIF($C$22:$C91,C91)-COUNTIFS($C$22:$C91,C91,$J$22:$J91,\"Team\"),\"\",COUNTIF($C$22:$C$103,C91)-COUNTIFS($C$22:$C$103,C91,$J$22:$J$103,\"Team\"))))","v":""},{"$f":"IF(Q91=\"\",\"\",IF(Q91=1,150,IF(Q91=2,250,IF(Q91=3,350,IF(Q91=\"team\",210/3,400)))))","v":""},null,"",{"$f":"IF(T91=\"\",IF(L91=\"Belt & age\",IF(V91=\"\",IF(E91=\"m\",\"Boys \"&VLOOKUP(G91,INFO!B$19:C$27,2,0),\"Girls \"&VLOOKUP(G91,INFO!B$47:C$55,2,0)),V91),IF(L91=\"weight\",\"\",V91)),IF(J91=\"Team\",W91,IF(T91<14,\"Children\",IF(T91<16,\"Cadet\",IF(T91<18,\"Junior\",IF(T91<21,\"Under 21\",IF(T91<40,\"Senior\",\"Veterans\"))))&\" Opens\")))","v":""},""]
["",{"$f":"IF(C92=\"\",\"\",IF(C92=C91,B91,IF(MATCH(C92,C$1:C$71,0)>=(ROW()-51),MAX(B$1:B91)+1,INDIRECT(\"b\"&(MATCH(C92,C$1:C$71,0)+51),1))))","v":""},null,null,null,"",null,{"$f":"IF(F92=\"\",\"\",IF(F92<=13,\"Children\",IF(F92<=15,\"Cadet\",IF(F92<=17,\"Junior\",\"Senior\"))))","v":""},"",null,null,null,null,null,"","",{"$f":"IF(C92=\"\",\"\",IF(J92=\"Team\",\"Team\",IF(COUNTIF($C$22:$C$103,C92)-COUNTIFS($C$22:$C$103,C92,$J$22:$J$103,\"Team\")>COUNTIF($C$22:$C92,C92)-COUNTIFS($C$22:$C92,C92,$J$22:$J92,\"Team\"),\"\",COUNTIF($C$22:$C$103,C92)-COUNTIFS($C$22:$C$103,C92,$J$22:$J$103,\"Team\"))))","v":""},{"$f":"IF(Q92=\"\",\"\",IF(Q92=1,150,IF(Q92=2,250,IF(Q92=3,350,IF(Q92=\"team\",210/3,400)))))","v":""},null,"",{"$f":"IF(T92=\"\",IF(L92=\"Belt & age\",IF(V92=\"\",IF(E92=\"m\",\"Boys \"&VLOOKUP(G92,INFO!B$19:C$27,2,0),\"Girls \"&VLOOKUP(G92,INFO!B$47:C$55,2,0)),V92),IF(L92=\"weight\",\"\",V92)),IF(J92=\"Team\",W92,IF(T92<14,\"Children\",IF(T92<16,\"Cadet\",IF(T92<18,\"Junior\",IF(T92<21,\"Under 21\",IF(T92<40,\"Senior\",\"Veterans\"))))&\" Opens\")))","v":""},""]
["",{"$f":"IF(C93=\"\",\"\",IF(C93=C92,B92,IF(MATCH(C93,C$1:C$71,0)>=(ROW()-51),MAX(B$1:B92)+1,INDIRECT(\"b\"&(MATCH(C93,C$1:C$71,0)+51),1))))","v":""},null,null,null,"",null,{"$f":"IF(F93=\"\",\"\",IF(F93<=13,\"Children\",IF(F93<=15,\"Cadet\",IF(F93<=17,\"Junior\",\"Senior\"))))","v":""},"",null,null,null,null,null,"","",{"$f":"IF(C93=\"\",\"\",IF(J93=\"Team\",\"Team\",IF(COUNTIF($C$22:$C$103,C93)-COUNTIFS($C$22:$C$103,C93,$J$22:$J$103,\"Team\")>COUNTIF($C$22:$C93,C93)-COUNTIFS($C$22:$C93,C93,$J$22:$J93,\"Team\"),\"\",COUNTIF($C$22:$C$103,C93)-COUNTIFS($C$22:$C$103,C93,$J$22:$J$103,\"Team\"))))","v":""},{"$f":"IF(Q93=\"\",\"\",IF(Q93=1,150,IF(Q93=2,250,IF(Q93=3,350,IF(Q93=\"team\",210/3,400)))))","v":""},null,"",{"$f":"IF(T93=\"\",IF(L93=\"Belt & age\",IF(V93=\"\",IF(E93=\"m\",\"Boys \"&VLOOKUP(G93,INFO!B$19:C$27,2,0),\"Girls \"&VLOOKUP(G93,INFO!B$47:C$55,2,0)),V93),IF(L93=\"weight\",\"\",V93)),IF(J93=\"Team\",W93,IF(T93<14,\"Children\",IF(T93<16,\"Cadet\",IF(T93<18,\"Junior\",IF(T93<21,\"Under 21\",IF(T93<40,\"Senior\",\"Veterans\"))))&\" Opens\")))","v":""},""]
["",{"$f":"IF(C94=\"\",\"\",IF(C94=C93,B93,IF(MATCH(C94,C$1:C$71,0)>=(ROW()-51),MAX(B$1:B93)+1,INDIRECT(\"b\"&(MATCH(C94,C$1:C$71,0)+51),1))))","v":""},null,null,null,"",null,{"$f":"IF(F94=\"\",\"\",IF(F94<=13,\"Children\",IF(F94<=15,\"Cadet\",IF(F94<=17,\"Junior\",\"Senior\"))))","v":""},"",null,null,null,null,null,"","",{"$f":"IF(C94=\"\",\"\",IF(J94=\"Team\",\"Team\",IF(COUNTIF($C$22:$C$103,C94)-COUNTIFS($C$22:$C$103,C94,$J$22:$J$103,\"Team\")>COUNTIF($C$22:$C94,C94)-COUNTIFS($C$22:$C94,C94,$J$22:$J94,\"Team\"),\"\",COUNTIF($C$22:$C$103,C94)-COUNTIFS($C$22:$C$103,C94,$J$22:$J$103,\"Team\"))))","v":""},{"$f":"IF(Q94=\"\",\"\",IF(Q94=1,150,IF(Q94=2,250,IF(Q94=3,350,IF(Q94=\"team\",210/3,400)))))","v":""},null,"",{"$f":"IF(T94=\"\",IF(L94=\"Belt & age\",IF(V94=\"\",IF(E94=\"m\",\"Boys \"&VLOOKUP(G94,INFO!B$19:C$27,2,0),\"Girls \"&VLOOKUP(G94,INFO!B$47:C$55,2,0)),V94),IF(L94=\"weight\",\"\",V94)),IF(J94=\"Team\",W94,IF(T94<14,\"Children\",IF(T94<16,\"Cadet\",IF(T94<18,\"Junior\",IF(T94<21,\"Under 21\",IF(T94<40,\"Senior\",\"Veterans\"))))&\" Opens\")))","v":""},""]
["",{"$f":"IF(C95=\"\",\"\",IF(C95=C94,B94,IF(MATCH(C95,C$1:C$71,0)>=(ROW()-51),MAX(B$1:B94)+1,INDIRECT(\"b\"&(MATCH(C95,C$1:C$71,0)+51),1))))","v":""},null,null,null,"",null,{"$f":"IF(F95=\"\",\"\",IF(F95<=13,\"Children\",IF(F95<=15,\"Cadet\",IF(F95<=17,\"Junior\",\"Senior\"))))","v":""},"",null,null,null,null,null,"","",{"$f":"IF(C95=\"\",\"\",IF(J95=\"Team\",\"Team\",IF(COUNTIF($C$22:$C$103,C95)-COUNTIFS($C$22:$C$103,C95,$J$22:$J$103,\"Team\")>COUNTIF($C$22:$C95,C95)-COUNTIFS($C$22:$C95,C95,$J$22:$J95,\"Team\"),\"\",COUNTIF($C$22:$C$103,C95)-COUNTIFS($C$22:$C$103,C95,$J$22:$J$103,\"Team\"))))","v":""},{"$f":"IF(Q95=\"\",\"\",IF(Q95=1,150,IF(Q95=2,250,IF(Q95=3,350,IF(Q95=\"team\",210/3,400)))))","v":""},null,"",{"$f":"IF(T95=\"\",IF(L95=\"Belt & age\",IF(V95=\"\",IF(E95=\"m\",\"Boys \"&VLOOKUP(G95,INFO!B$19:C$27,2,0),\"Girls \"&VLOOKUP(G95,INFO!B$47:C$55,2,0)),V95),IF(L95=\"weight\",\"\",V95)),IF(J95=\"Team\",W95,IF(T95<14,\"Children\",IF(T95<16,\"Cadet\",IF(T95<18,\"Junior\",IF(T95<21,\"Under 21\",IF(T95<40,\"Senior\",\"Veterans\"))))&\" Opens\")))","v":""},""]
["",{"$f":"IF(C96=\"\",\"\",IF(C96=C95,B95,IF(MATCH(C96,C$1:C$71,0)>=(ROW()-51),MAX(B$1:B95)+1,INDIRECT(\"b\"&(MATCH(C96,C$1:C$71,0)+51),1))))","v":""},null,null,null,"",null,{"$f":"IF(F96=\"\",\"\",IF(F96<=13,\"Children\",IF(F96<=15,\"Cadet\",IF(F96<=17,\"Junior\",\"Senior\"))))","v":""},"",null,null,null,null,null,"","",{"$f":"IF(C96=\"\",\"\",IF(J96=\"Team\",\"Team\",IF(COUNTIF($C$22:$C$103,C96)-COUNTIFS($C$22:$C$103,C96,$J$22:$J$103,\"Team\")>COUNTIF($C$22:$C96,C96)-COUNTIFS($C$22:$C96,C96,$J$22:$J96,\"Team\"),\"\",COUNTIF($C$22:$C$103,C96)-COUNTIFS($C$22:$C$103,C96,$J$22:$J$103,\"Team\"))))","v":""},{"$f":"IF(Q96=\"\",\"\",IF(Q96=1,150,IF(Q96=2,250,IF(Q96=3,350,IF(Q96=\"team\",210/3,400)))))","v":""},null,"",{"$f":"IF(T96=\"\",IF(L96=\"Belt & age\",IF(V96=\"\",IF(E96=\"m\",\"Boys \"&VLOOKUP(G96,INFO!B$19:C$27,2,0),\"Girls \"&VLOOKUP(G96,INFO!B$47:C$55,2,0)),V96),IF(L96=\"weight\",\"\",V96)),IF(J96=\"Team\",W96,IF(T96<14,\"Children\",IF(T96<16,\"Cadet\",IF(T96<18,\"Junior\",IF(T96<21,\"Under 21\",IF(T96<40,\"Senior\",\"Veterans\"))))&\" Opens\")))","v":""},""]
["",{"$f":"IF(C97=\"\",\"\",IF(C97=C96,B96,IF(MATCH(C97,C$1:C$71,0)>=(ROW()-51),MAX(B$1:B96)+1,INDIRECT(\"b\"&(MATCH(C97,C$1:C$71,0)+51),1))))","v":""},null,null,null,"",null,{"$f":"IF(F97=\"\",\"\",IF(F97<=13,\"Children\",IF(F97<=15,\"Cadet\",IF(F97<=17,\"Junior\",\"Senior\"))))","v":""},"",null,null,null,null,null,"","",{"$f":"IF(C97=\"\",\"\",IF(J97=\"Team\",\"Team\",IF(COUNTIF($C$22:$C$103,C97)-COUNTIFS($C$22:$C$103,C97,$J$22:$J$103,\"Team\")>COUNTIF($C$22:$C97,C97)-COUNTIFS($C$22:$C97,C97,$J$22:$J97,\"Team\"),\"\",COUNTIF($C$22:$C$103,C97)-COUNTIFS($C$22:$C$103,C97,$J$22:$J$103,\"Team\"))))","v":""},{"$f":"IF(Q97=\"\",\"\",IF(Q97=1,150,IF(Q97=2,250,IF(Q97=3,350,IF(Q97=\"team\",210/3,400)))))","v":""},null,"",{"$f":"IF(T97=\"\",IF(L97=\"Belt & age\",IF(V97=\"\",IF(E97=\"m\",\"Boys \"&VLOOKUP(G97,INFO!B$19:C$27,2,0),\"Girls \"&VLOOKUP(G97,INFO!B$47:C$55,2,0)),V97),IF(L97=\"weight\",\"\",V97)),IF(J97=\"Team\",W97,IF(T97<14,\"Children\",IF(T97<16,\"Cadet\",IF(T97<18,\"Junior\",IF(T97<21,\"Under 21\",IF(T97<40,\"Senior\",\"Veterans\"))))&\" Opens\")))","v":""},""]
["",{"$f":"IF(C98=\"\",\"\",IF(C98=C97,B97,IF(MATCH(C98,C$1:C$71,0)>=(ROW()-51),MAX(B$1:B97)+1,INDIRECT(\"b\"&(MATCH(C98,C$1:C$71,0)+51),1))))","v":""},null,null,null,"",null,{"$f":"IF(F98=\"\",\"\",IF(F98<=13,\"Children\",IF(F98<=15,\"Cadet\",IF(F98<=17,\"Junior\",\"Senior\"))))","v":""},"",null,null,null,null,null,"","",{"$f":"IF(C98=\"\",\"\",IF(J98=\"Team\",\"Team\",IF(COUNTIF($C$22:$C$103,C98)-COUNTIFS($C$22:$C$103,C98,$J$22:$J$103,\"Team\")>COUNTIF($C$22:$C98,C98)-COUNTIFS($C$22:$C98,C98,$J$22:$J98,\"Team\"),\"\",COUNTIF($C$22:$C$103,C98)-COUNTIFS($C$22:$C$103,C98,$J$22:$J$103,\"Team\"))))","v":""},{"$f":"IF(Q98=\"\",\"\",IF(Q98=1,150,IF(Q98=2,250,IF(Q98=3,350,IF(Q98=\"team\",210/3,400)))))","v":""},null,"",{"$f":"IF(T98=\"\",IF(L98=\"Belt & age\",IF(V98=\"\",IF(E98=\"m\",\"Boys \"&VLOOKUP(G98,INFO!B$19:C$27,2,0),\"Girls \"&VLOOKUP(G98,INFO!B$47:C$55,2,0)),V98),IF(L98=\"weight\",\"\",V98)),IF(J98=\"Team\",W98,IF(T98<14,\"Children\",IF(T98<16,\"Cadet\",IF(T98<18,\"Junior\",IF(T98<21,\"Under 21\",IF(T98<40,\"Senior\",\"Veterans\"))))&\" Opens\")))","v":""},""]
["",{"$f":"IF(C99=\"\",\"\",IF(C99=C98,B98,IF(MATCH(C99,C$1:C$71,0)>=(ROW()-51),MAX(B$1:B98)+1,INDIRECT(\"b\"&(MATCH(C99,C$1:C$71,0)+51),1))))","v":""},null,null,null,"",null,{"$f":"IF(F99=\"\",\"\",IF(F99<=13,\"Children\",IF(F99<=15,\"Cadet\",IF(F99<=17,\"Junior\",\"Senior\"))))","v":""},"",null,null,null,null,null,"","",{"$f":"IF(C99=\"\",\"\",IF(J99=\"Team\",\"Team\",IF(COUNTIF($C$22:$C$103,C99)-COUNTIFS($C$22:$C$103,C99,$J$22:$J$103,\"Team\")>COUNTIF($C$22:$C99,C99)-COUNTIFS($C$22:$C99,C99,$J$22:$J99,\"Team\"),\"\",COUNTIF($C$22:$C$103,C99)-COUNTIFS($C$22:$C$103,C99,$J$22:$J$103,\"Team\"))))","v":""},{"$f":"IF(Q99=\"\",\"\",IF(Q99=1,150,IF(Q99=2,250,IF(Q99=3,350,IF(Q99=\"team\",210/3,400)))))","v":""},null,"",{"$f":"IF(T99=\"\",IF(L99=\"Belt & age\",IF(V99=\"\",IF(E99=\"m\",\"Boys \"&VLOOKUP(G99,INFO!B$19:C$27,2,0),\"Girls \"&VLOOKUP(G99,INFO!B$47:C$55,2,0)),V99),IF(L99=\"weight\",\"\",V99)),IF(J99=\"Team\",W99,IF(T99<14,\"Children\",IF(T99<16,\"Cadet\",IF(T99<18,\"Junior\",IF(T99<21,\"Under 21\",IF(T99<40,\"Senior\",\"Veterans\"))))&\" Opens\")))","v":""},""]
["",{"$f":"IF(C100=\"\",\"\",IF(C100=C99,B99,IF(MATCH(C100,C$1:C$71,0)>=(ROW()-51),MAX(B$1:B99)+1,INDIRECT(\"b\"&(MATCH(C100,C$1:C$71,0)+51),1))))","v":""},null,null,null,"",null,{"$f":"IF(F100=\"\",\"\",IF(F100<=13,\"Children\",IF(F100<=15,\"Cadet\",IF(F100<=17,\"Junior\",\"Senior\"))))","v":""},"",null,null,null,null,null,"","",{"$f":"IF(C100=\"\",\"\",IF(J100=\"Team\",\"Team\",IF(COUNTIF($C$22:$C$103,C100)-COUNTIFS($C$22:$C$103,C100,$J$22:$J$103,\"Team\")>COUNTIF($C$22:$C100,C100)-COUNTIFS($C$22:$C100,C100,$J$22:$J100,\"Team\"),\"\",COUNTIF($C$22:$C$103,C100)-COUNTIFS($C$22:$C$103,C100,$J$22:$J$103,\"Team\"))))","v":""},{"$f":"IF(Q100=\"\",\"\",IF(Q100=1,150,IF(Q100=2,250,IF(Q100=3,350,IF(Q100=\"team\",210/3,400)))))","v":""},null,"",{"$f":"IF(T100=\"\",IF(L100=\"Belt & age\",IF(V100=\"\",IF(E100=\"m\",\"Boys \"&VLOOKUP(G100,INFO!B$19:C$27,2,0),\"Girls \"&VLOOKUP(G100,INFO!B$47:C$55,2,0)),V100),IF(L100=\"weight\",\"\",V100)),IF(J100=\"Team\",W100,IF(T100<14,\"Children\",IF(T100<16,\"Cadet\",IF(T100<18,\"Junior\",IF(T100<21,\"Under 21\",IF(T100<40,\"Senior\",\"Veterans\"))))&\" Opens\")))","v":""},""]
["",{"$f":"IF(C101=\"\",\"\",IF(C101=C100,B100,IF(MATCH(C101,C$1:C$71,0)>=(ROW()-51),MAX(B$1:B100)+1,INDIRECT(\"b\"&(MATCH(C101,C$1:C$71,0)+51),1))))","v":""},null,null,null,"",null,{"$f":"IF(F101=\"\",\"\",IF(F101<=13,\"Children\",IF(F101<=15,\"Cadet\",IF(F101<=17,\"Junior\",\"Senior\"))))","v":""},"",null,null,null,null,null,"","",{"$f":"IF(C101=\"\",\"\",IF(J101=\"Team\",\"Team\",IF(COUNTIF($C$22:$C$103,C101)-COUNTIFS($C$22:$C$103,C101,$J$22:$J$103,\"Team\")>COUNTIF($C$22:$C101,C101)-COUNTIFS($C$22:$C101,C101,$J$22:$J101,\"Team\"),\"\",COUNTIF($C$22:$C$103,C101)-COUNTIFS($C$22:$C$103,C101,$J$22:$J$103,\"Team\"))))","v":""},{"$f":"IF(Q101=\"\",\"\",IF(Q101=1,150,IF(Q101=2,250,IF(Q101=3,350,IF(Q101=\"team\",210/3,400)))))","v":""},null,"",{"$f":"IF(T101=\"\",IF(L101=\"Belt & age\",IF(V101=\"\",IF(E101=\"m\",\"Boys \"&VLOOKUP(G101,INFO!B$19:C$27,2,0),\"Girls \"&VLOOKUP(G101,INFO!B$47:C$55,2,0)),V101),IF(L101=\"weight\",\"\",V101)),IF(J101=\"Team\",W101,IF(T101<14,\"Children\",IF(T101<16,\"Cadet\",IF(T101<18,\"Junior\",IF(T101<21,\"Under 21\",IF(T101<40,\"Senior\",\"Veterans\"))))&\" Opens\")))","v":""},""]
["",{"$f":"IF(C102=\"\",\"\",IF(C102=C101,B101,IF(MATCH(C102,C$1:C$71,0)>=(ROW()-51),MAX(B$1:B101)+1,INDIRECT(\"b\"&(MATCH(C102,C$1:C$71,0)+51),1))))","v":""},null,null,null,"",null,{"$f":"IF(F102=\"\",\"\",IF(F102<=13,\"Children\",IF(F102<=15,\"Cadet\",IF(F102<=17,\"Junior\",\"Senior\"))))","v":""},"",null,null,null,null,null,"","",{"$f":"IF(C102=\"\",\"\",IF(J102=\"Team\",\"Team\",IF(COUNTIF($C$22:$C$103,C102)-COUNTIFS($C$22:$C$103,C102,$J$22:$J$103,\"Team\")>COUNTIF($C$22:$C102,C102)-COUNTIFS($C$22:$C102,C102,$J$22:$J102,\"Team\"),\"\",COUNTIF($C$22:$C$103,C102)-COUNTIFS($C$22:$C$103,C102,$J$22:$J$103,\"Team\"))))","v":""},{"$f":"IF(Q102=\"\",\"\",IF(Q102=1,150,IF(Q102=2,250,IF(Q102=3,350,IF(Q102=\"team\",210/3,400)))))","v":""},null,"",{"$f":"IF(T102=\"\",IF(L102=\"Belt & age\",IF(V102=\"\",IF(E102=\"m\",\"Boys \"&VLOOKUP(G102,INFO!B$19:C$27,2,0),\"Girls \"&VLOOKUP(G102,INFO!B$47:C$55,2,0)),V102),IF(L102=\"weight\",\"\",V102)),IF(J102=\"Team\",W102,IF(T102<14,\"Children\",IF(T102<16,\"Cadet\",IF(T102<18,\"Junior\",IF(T102<21,\"Under 21\",IF(T102<40,\"Senior\",\"Veterans\"))))&\" Opens\")))","v":""},""]
["",{"$f":"IF(C103=\"\",\"\",IF(C103=C102,B102,IF(MATCH(C103,C$1:C$71,0)>=(ROW()-51),MAX(B$1:B102)+1,INDIRECT(\"b\"&(MATCH(C103,C$1:C$71,0)+51),1))))","v":""},null,null,null,"",null,{"$f":"IF(F103=\"\",\"\",IF(F103<=13,\"Children\",IF(F103<=15,\"Cadet\",IF(F103<=17,\"Junior\",\"Senior\"))))","v":""},"",null,null,null,null,null,"","",{"$f":"IF(C103=\"\",\"\",IF(J103=\"Team\",\"Team\",IF(COUNTIF($C$22:$C$103,C103)-COUNTIFS($C$22:$C$103,C103,$J$22:$J$103,\"Team\")>COUNTIF($C$22:$C103,C103)-COUNTIFS($C$22:$C103,C103,$J$22:$J103,\"Team\"),\"\",COUNTIF($C$22:$C$103,C103)-COUNTIFS($C$22:$C$103,C103,$J$22:$J$103,\"Team\"))))","v":""},{"$f":"IF(Q103=\"\",\"\",IF(Q103=1,150,IF(Q103=2,250,IF(Q103=3,350,IF(Q103=\"team\",210/3,400)))))","v":""},null,"",{"$f":"IF(T103=\"\",IF(L103=\"Belt & age\",IF(V103=\"\",IF(E103=\"m\",\"Boys \"&VLOOKUP(G103,INFO!B$19:C$27,2,0),\"Girls \"&VLOOKUP(G103,INFO!B$47:C$55,2,0)),V103),IF(L103=\"weight\",\"\",V103)),IF(J103=\"Team\",W103,IF(T103<14,\"Children\",IF(T103<16,\"Cadet\",IF(T103<18,\"Junior\",IF(T103<21,\"Under 21\",IF(T103<40,\"Senior\",\"Veterans\"))))&\" Opens\")))","v":""},""]
[null,null,"TEAM EVENT RESERVES"]
[null,null,null,null,null,{"$f":"IF(D105=\"\",\"\",IF(MONTH($Q$1)>=MONTH(D105),IF(MONTH($Q$1)=MONTH(D105),IF(DAY($Q$1)>=DAY(D105),YEAR($Q$1)-YEAR(D105),YEAR($Q$1)-YEAR(D105)-1),YEAR($Q$1)-YEAR(D105)),YEAR($Q$1)-YEAR(D105)-1))","v":""},null,{"$f":"IF(F105=\"\",\"\",IF(F105<=13,\"Children\",IF(F105<=15,\"Cadet\",IF(F105<=17,\"Junior\",\"Senior\"))))","v":""},{"$f":"IF(C105=\"\",\"\",+$D$2)","v":""},null,null,null,null,null,{"$f":"IF(J105=\"Individual\",IF(K105=\"Kata\",\"X\",IF(K105=\"Superkata\",\"S\",\"\")),IF(K105=\"kata\",\"T\",\"\"))","v":""},{"$f":"IF(J105=\"Individual\",IF(K105=\"Kumite\",\"X\",\"\"),IF(K105=\"kumite\",\"T\",\"\"))","v":""},{"$f":"IF(C105=\"\",\"\",IF(J105=\"Team\",\"Team\",IF(B105=B106,IF(J106=\"Team\",COUNTIF($C$22:$C$103,C105)-COUNTIFS($C$22:$C$103,C105,$J$22:$J$103,\"Team\"),\"\"),IF(J105=\"Team\",\"Team\",COUNTIF($C$22:$C$103,C105)-COUNTIFS($C$22:$C$103,C105,$J$22:$J$103,\"Team\")))))","v":""},null,null,{"$f":"IF(L105=\"Open *\",IF(D105=\"\",\"\",IF(MONTH($Q$2)>=MONTH(D105),IF(MONTH($Q$2)=MONTH(D105),IF(DAY($Q$2)>=DAY(D105),YEAR($Q$2)-YEAR(D105),YEAR($Q$2)-YEAR(D105)-1),YEAR($Q$2)-YEAR(D105)),YEAR($Q$2)-YEAR(D105)-1)),\"\")","v":""},{"$f":"IF(T105=\"\",\"\",IF(T105<14,\"Children\",IF(T105<16,\"Cadet\",IF(T105<18,\"Junior\",\"Senior\"))&\" Opens\"))","v":""},{"$f":"IF(F105>=14,IF(L105=\"Belt & Age\",IF(OR(G105=\"brown\",G105=\"black\"),\"NO SUCH DIVISION!!!\",\"Development\"),\"\"))","v":""}]
[null,null,null,null,null,"",null,{"$f":"IF(F106=\"\",\"\",IF(F106<=13,\"Children\",IF(F106<=15,\"Cadet\",IF(F106<=17,\"Junior\",\"Senior\"))))","v":""},"",null,null,null,null,null,"","",{"$f":"IF(C106=\"\",\"\",IF(J106=\"Team\",\"Team\",IF(B106=B107,IF(J107=\"Team\",COUNTIF($C$22:$C$103,C106)-COUNTIFS($C$22:$C$103,C106,$J$22:$J$103,\"Team\"),\"\"),IF(J106=\"Team\",\"Team\",COUNTIF($C$22:$C$103,C106)-COUNTIFS($C$22:$C$103,C106,$J$22:$J$103,\"Team\")))))","v":""},null,null,"",{"$f":"IF(T106=\"\",\"\",IF(T106<14,\"Children\",IF(T106<16,\"Cadet\",IF(T106<18,\"Junior\",\"Senior\"))&\" Opens\"))","v":""},{"$f":"IF(F106>=14,IF(L106=\"Belt & Age\",IF(OR(G106=\"brown\",G106=\"black\"),\"NO SUCH DIVISION!!!\",\"Development\"),\"\"))","v":""}]
[null,null,null,null,null,"",null,{"$f":"IF(F107=\"\",\"\",IF(F107<=13,\"Children\",IF(F107<=15,\"Cadet\",IF(F107<=17,\"Junior\",\"Senior\"))))","v":""},"",null,null,null,null,null,"","",{"$f":"IF(C107=\"\",\"\",IF(J107=\"Team\",\"Team\",IF(B107=B108,IF(J108=\"Team\",COUNTIF($C$22:$C$103,C107)-COUNTIFS($C$22:$C$103,C107,$J$22:$J$103,\"Team\"),\"\"),IF(J107=\"Team\",\"Team\",COUNTIF($C$22:$C$103,C107)-COUNTIFS($C$22:$C$103,C107,$J$22:$J$103,\"Team\")))))","v":""},null,null,"",{"$f":"IF(T107=\"\",\"\",IF(T107<14,\"Children\",IF(T107<16,\"Cadet\",IF(T107<18,\"Junior\",\"Senior\"))&\" Opens\"))","v":""},{"$f":"IF(F107>=14,IF(L107=\"Belt & Age\",IF(OR(G107=\"brown\",G107=\"black\"),\"NO SUCH DIVISION!!!\",\"Development\"),\"\"))","v":""}]
[null,null,null,null,null,"",null,{"$f":"IF(F108=\"\",\"\",IF(F108<=13,\"Children\",IF(F108<=15,\"Cadet\",IF(F108<=17,\"Junior\",\"Senior\"))))","v":""},"",null,null,null,null,null,"","",{"$f":"IF(C108=\"\",\"\",IF(J108=\"Team\",\"Team\",IF(B108=B109,IF(J109=\"Team\",COUNTIF($C$22:$C$103,C108)-COUNTIFS($C$22:$C$103,C108,$J$22:$J$103,\"Team\"),\"\"),IF(J108=\"Team\",\"Team\",COUNTIF($C$22:$C$103,C108)-COUNTIFS($C$22:$C$103,C108,$J$22:$J$103,\"Team\")))))","v":""},null,null,"",{"$f":"IF(T108=\"\",\"\",IF(T108<14,\"Children\",IF(T108<16,\"Cadet\",IF(T108<18,\"Junior\",\"Senior\"))&\" Opens\"))","v":""},{"$f":"IF(F108>=14,IF(L108=\"Belt & Age\",IF(OR(G108=\"brown\",G108=\"black\"),\"NO SUCH DIVISION!!!\",\"Development\"),\"\"))","v":""}]
[null,null,null,null,null,"",null,{"$f":"IF(F109=\"\",\"\",IF(F109<=13,\"Children\",IF(F109<=15,\"Cadet\",IF(F109<=17,\"Junior\",\"Senior\"))))","v":""},"",null,null,null,null,null,"","",{"$f":"IF(C109=\"\",\"\",IF(J109=\"Team\",\"Team\",IF(B109=B110,IF(J110=\"Team\",COUNTIF($C$22:$C$103,C109)-COUNTIFS($C$22:$C$103,C109,$J$22:$J$103,\"Team\"),\"\"),IF(J109=\"Team\",\"Team\",COUNTIF($C$22:$C$103,C109)-COUNTIFS($C$22:$C$103,C109,$J$22:$J$103,\"Team\")))))","v":""},null,null,"",{"$f":"IF(T109=\"\",\"\",IF(T109<14,\"Children\",IF(T109<16,\"Cadet\",IF(T109<18,\"Junior\",\"Senior\"))&\" Opens\"))","v":""},{"$f":"IF(F109>=14,IF(L109=\"Belt & Age\",IF(OR(G109=\"brown\",G109=\"black\"),\"NO SUCH DIVISION!!!\",\"Development\"),\"\"))","v":""}]
[null,null,null,null,null,"",null,{"$f":"IF(F110=\"\",\"\",IF(F110<=13,\"Children\",IF(F110<=15,\"Cadet\",IF(F110<=17,\"Junior\",\"Senior\"))))","v":""},"",null,null,null,null,null,"","",{"$f":"IF(C110=\"\",\"\",IF(J110=\"Team\",\"Team\",IF(B110=B111,IF(J111=\"Team\",COUNTIF($C$22:$C$103,C110)-COUNTIFS($C$22:$C$103,C110,$J$22:$J$103,\"Team\"),\"\"),IF(J110=\"Team\",\"Team\",COUNTIF($C$22:$C$103,C110)-COUNTIFS($C$22:$C$103,C110,$J$22:$J$103,\"Team\")))))","v":""},null,null,"",{"$f":"IF(T110=\"\",\"\",IF(T110<14,\"Children\",IF(T110<16,\"Cadet\",IF(T110<18,\"Junior\",\"Senior\"))&\" Opens\"))","v":""},{"$f":"IF(F110>=14,IF(L110=\"Belt & Age\",IF(OR(G110=\"brown\",G110=\"black\"),\"NO SUCH DIVISION!!!\",\"Development\"),\"\"))","v":""}]
[null,null,null,null,null,"",null,{"$f":"IF(F111=\"\",\"\",IF(F111<=13,\"Children\",IF(F111<=15,\"Cadet\",IF(F111<=17,\"Junior\",\"Senior\"))))","v":""},"",null,null,null,null,null,"","",{"$f":"IF(C111=\"\",\"\",IF(J111=\"Team\",\"Team\",IF(B111=B112,IF(J112=\"Team\",COUNTIF($C$22:$C$103,C111)-COUNTIFS($C$22:$C$103,C111,$J$22:$J$103,\"Team\"),\"\"),IF(J111=\"Team\",\"Team\",COUNTIF($C$22:$C$103,C111)-COUNTIFS($C$22:$C$103,C111,$J$22:$J$103,\"Team\")))))","v":""},null,null,"",{"$f":"IF(T111=\"\",\"\",IF(T111<14,\"Children\",IF(T111<16,\"Cadet\",IF(T111<18,\"Junior\",\"Senior\"))&\" Opens\"))","v":""},{"$f":"IF(F111>=14,IF(L111=\"Belt & Age\",IF(OR(G111=\"brown\",G111=\"black\"),\"NO SUCH DIVISION!!!\",\"Development\"),\"\"))","v":""}]

{"sheet":"Fee","index":2,"n_rows":166,"n_cols":5,"rows_kept":166,"cut":false,"hidden":false,"merged":[]}
[null,"Total",{"$f":"SUM(C4:C166)","v":0},{"$f":"SUM(D4:D166)","v":0},0]
[]
[null,"Name of competitor","Fee Due","Fee Paid","Balance"]
[1,{"$f":"IFERROR(IF(VLOOKUP($A4,'Entry form'!$B$22:$R$103,2,0)=\"\",\"\",VLOOKUP($A4,'Entry form'!$B$22:$R$103,2,0)),\"\")","v":""},{"$f":"SUMIF('Entry form'!$C$22:$C$103,$B4,'Entry form'!$R$22:$R$103)","v":0},null,{"$f":"IF(C4=\"\",\"\",C4-D4)","v":0}]
[{"$f":"+A4+1","v":2},{"$f":"IFERROR(IF(VLOOKUP($A5,'Entry form'!$B$22:$R$103,2,0)=\"\",\"\",VLOOKUP($A5,'Entry form'!$B$22:$R$103,2,0)),\"\")","v":""},{"$f":"SUMIF('Entry form'!$C$22:$C$103,$B5,'Entry form'!$R$22:$R$103)","v":0},null,{"$f":"IF(C5=\"\",\"\",C5-D5)","v":0}]
[{"$f":"+A5+1","v":3},{"$f":"IFERROR(IF(VLOOKUP($A6,'Entry form'!$B$22:$R$103,2,0)=\"\",\"\",VLOOKUP($A6,'Entry form'!$B$22:$R$103,2,0)),\"\")","v":""},{"$f":"SUMIF('Entry form'!$C$22:$C$103,$B6,'Entry form'!$R$22:$R$103)","v":0},null,0]
[4,{"$f":"IFERROR(IF(VLOOKUP($A7,'Entry form'!$B$22:$R$103,2,0)=\"\",\"\",VLOOKUP($A7,'Entry form'!$B$22:$R$103,2,0)),\"\")","v":""},{"$f":"SUMIF('Entry form'!$C$22:$C$103,$B7,'Entry form'!$R$22:$R$103)","v":0},null,0]
[5,{"$f":"IFERROR(IF(VLOOKUP($A8,'Entry form'!$B$22:$R$103,2,0)=\"\",\"\",VLOOKUP($A8,'Entry form'!$B$22:$R$103,2,0)),\"\")","v":""},{"$f":"SUMIF('Entry form'!$C$22:$C$103,$B8,'Entry form'!$R$22:$R$103)","v":0},null,0]
[6,{"$f":"IFERROR(IF(VLOOKUP($A9,'Entry form'!$B$22:$R$103,2,0)=\"\",\"\",VLOOKUP($A9,'Entry form'!$B$22:$R$103,2,0)),\"\")","v":""},{"$f":"SUMIF('Entry form'!$C$22:$C$103,$B9,'Entry form'!$R$22:$R$103)","v":0},null,0]
[7,{"$f":"IFERROR(IF(VLOOKUP($A10,'Entry form'!$B$22:$R$103,2,0)=\"\",\"\",VLOOKUP($A10,'Entry form'!$B$22:$R$103,2,0)),\"\")","v":""},{"$f":"SUMIF('Entry form'!$C$22:$C$103,$B10,'Entry form'!$R$22:$R$103)","v":0},null,0]
[8,{"$f":"IFERROR(IF(VLOOKUP($A11,'Entry form'!$B$22:$R$103,2,0)=\"\",\"\",VLOOKUP($A11,'Entry form'!$B$22:$R$103,2,0)),\"\")","v":""},{"$f":"SUMIF('Entry form'!$C$22:$C$103,$B11,'Entry form'!$R$22:$R$103)","v":0},null,0]
[9,{"$f":"IFERROR(IF(VLOOKUP($A12,'Entry form'!$B$22:$R$103,2,0)=\"\",\"\",VLOOKUP($A12,'Entry form'!$B$22:$R$103,2,0)),\"\")","v":""},{"$f":"SUMIF('Entry form'!$C$22:$C$103,$B12,'Entry form'!$R$22:$R$103)","v":0},null,0]
[10,{"$f":"IFERROR(IF(VLOOKUP($A13,'Entry form'!$B$22:$R$103,2,0)=\"\",\"\",VLOOKUP($A13,'Entry form'!$B$22:$R$103,2,0)),\"\")","v":""},{"$f":"SUMIF('Entry form'!$C$22:$C$103,$B13,'Entry form'!$R$22:$R$103)","v":0},null,0]
[11,{"$f":"IFERROR(IF(VLOOKUP($A14,'Entry form'!$B$22:$R$103,2,0)=\"\",\"\",VLOOKUP($A14,'Entry form'!$B$22:$R$103,2,0)),\"\")","v":""},{"$f":"SUMIF('Entry form'!$C$22:$C$103,$B14,'Entry form'!$R$22:$R$103)","v":0},null,0]
[12,{"$f":"IFERROR(IF(VLOOKUP($A15,'Entry form'!$B$22:$R$103,2,0)=\"\",\"\",VLOOKUP($A15,'Entry form'!$B$22:$R$103,2,0)),\"\")","v":""},{"$f":"SUMIF('Entry form'!$C$22:$C$103,$B15,'Entry form'!$R$22:$R$103)","v":0},null,0]
[13,{"$f":"IFERROR(IF(VLOOKUP($A16,'Entry form'!$B$22:$R$103,2,0)=\"\",\"\",VLOOKUP($A16,'Entry form'!$B$22:$R$103,2,0)),\"\")","v":""},{"$f":"SUMIF('Entry form'!$C$22:$C$103,$B16,'Entry form'!$R$22:$R$103)","v":0},null,0]
[14,{"$f":"IFERROR(IF(VLOOKUP($A17,'Entry form'!$B$22:$R$103,2,0)=\"\",\"\",VLOOKUP($A17,'Entry form'!$B$22:$R$103,2,0)),\"\")","v":""},{"$f":"SUMIF('Entry form'!$C$22:$C$103,$B17,'Entry form'!$R$22:$R$103)","v":0},null,0]
[15,{"$f":"IFERROR(IF(VLOOKUP($A18,'Entry form'!$B$22:$R$103,2,0)=\"\",\"\",VLOOKUP($A18,'Entry form'!$B$22:$R$103,2,0)),\"\")","v":""},{"$f":"SUMIF('Entry form'!$C$22:$C$103,$B18,'Entry form'!$R$22:$R$103)","v":0},null,0]
[16,{"$f":"IFERROR(IF(VLOOKUP($A19,'Entry form'!$B$22:$R$103,2,0)=\"\",\"\",VLOOKUP($A19,'Entry form'!$B$22:$R$103,2,0)),\"\")","v":""},{"$f":"SUMIF('Entry form'!$C$22:$C$103,$B19,'Entry form'!$R$22:$R$103)","v":0},null,0]
[17,{"$f":"IFERROR(IF(VLOOKUP($A20,'Entry form'!$B$22:$R$103,2,0)=\"\",\"\",VLOOKUP($A20,'Entry form'!$B$22:$R$103,2,0)),\"\")","v":""},{"$f":"SUMIF('Entry form'!$C$22:$C$103,$B20,'Entry form'!$R$22:$R$103)","v":0},null,0]
[18,{"$f":"IFERROR(IF(VLOOKUP($A21,'Entry form'!$B$22:$R$103,2,0)=\"\",\"\",VLOOKUP($A21,'Entry form'!$B$22:$R$103,2,0)),\"\")","v":""},{"$f":"SUMIF('Entry form'!$C$22:$C$103,$B21,'Entry form'!$R$22:$R$103)","v":0},null,0]
[19,{"$f":"IFERROR(IF(VLOOKUP($A22,'Entry form'!$B$22:$R$103,2,0)=\"\",\"\",VLOOKUP($A22,'Entry form'!$B$22:$R$103,2,0)),\"\")","v":""},{"$f":"SUMIF('Entry form'!$C$22:$C$103,$B22,'Entry form'!$R$22:$R$103)","v":0},null,0]
[20,{"$f":"IFERROR(IF(VLOOKUP($A23,'Entry form'!$B$22:$R$103,2,0)=\"\",\"\",VLOOKUP($A23,'Entry form'!$B$22:$R$103,2,0)),\"\")","v":""},{"$f":"SUMIF('Entry form'!$C$22:$C$103,$B23,'Entry form'!$R$22:$R$103)","v":0},null,0]
[21,{"$f":"IFERROR(IF(VLOOKUP($A24,'Entry form'!$B$22:$R$103,2,0)=\"\",\"\",VLOOKUP($A24,'Entry form'!$B$22:$R$103,2,0)),\"\")","v":""},{"$f":"SUMIF('Entry form'!$C$22:$C$103,$B24,'Entry form'!$R$22:$R$103)","v":0},null,0]
[22,{"$f":"IFERROR(IF(VLOOKUP($A25,'Entry form'!$B$22:$R$103,2,0)=\"\",\"\",VLOOKUP($A25,'Entry form'!$B$22:$R$103,2,0)),\"\")","v":""},{"$f":"SUMIF('Entry form'!$C$22:$C$103,$B25,'Entry form'!$R$22:$R$103)","v":0},null,0]
[23,{"$f":"IFERROR(IF(VLOOKUP($A26,'Entry form'!$B$22:$R$103,2,0)=\"\",\"\",VLOOKUP($A26,'Entry form'!$B$22:$R$103,2,0)),\"\")","v":""},{"$f":"SUMIF('Entry form'!$C$22:$C$103,$B26,'Entry form'!$R$22:$R$103)","v":0},null,0]
[24,{"$f":"IFERROR(IF(VLOOKUP($A27,'Entry form'!$B$22:$R$103,2,0)=\"\",\"\",VLOOKUP($A27,'Entry form'!$B$22:$R$103,2,0)),\"\")","v":""},{"$f":"SUMIF('Entry form'!$C$22:$C$103,$B27,'Entry form'!$R$22:$R$103)","v":0},null,0]
[25,{"$f":"IFERROR(IF(VLOOKUP($A28,'Entry form'!$B$22:$R$103,2,0)=\"\",\"\",VLOOKUP($A28,'Entry form'!$B$22:$R$103,2,0)),\"\")","v":""},{"$f":"SUMIF('Entry form'!$C$22:$C$103,$B28,'Entry form'!$R$22:$R$103)","v":0},null,0]
[26,{"$f":"IFERROR(IF(VLOOKUP($A29,'Entry form'!$B$22:$R$103,2,0)=\"\",\"\",VLOOKUP($A29,'Entry form'!$B$22:$R$103,2,0)),\"\")","v":""},{"$f":"SUMIF('Entry form'!$C$22:$C$103,$B29,'Entry form'!$R$22:$R$103)","v":0},null,0]
[27,{"$f":"IFERROR(IF(VLOOKUP($A30,'Entry form'!$B$22:$R$103,2,0)=\"\",\"\",VLOOKUP($A30,'Entry form'!$B$22:$R$103,2,0)),\"\")","v":""},{"$f":"SUMIF('Entry form'!$C$22:$C$103,$B30,'Entry form'!$R$22:$R$103)","v":0},null,0]
[28,{"$f":"IFERROR(IF(VLOOKUP($A31,'Entry form'!$B$22:$R$103,2,0)=\"\",\"\",VLOOKUP($A31,'Entry form'!$B$22:$R$103,2,0)),\"\")","v":""},{"$f":"SUMIF('Entry form'!$C$22:$C$103,$B31,'Entry form'!$R$22:$R$103)","v":0},null,0]
[29,{"$f":"IFERROR(IF(VLOOKUP($A32,'Entry form'!$B$22:$R$103,2,0)=\"\",\"\",VLOOKUP($A32,'Entry form'!$B$22:$R$103,2,0)),\"\")","v":""},{"$f":"SUMIF('Entry form'!$C$22:$C$103,$B32,'Entry form'!$R$22:$R$103)","v":0},null,0]
[30,{"$f":"IFERROR(IF(VLOOKUP($A33,'Entry form'!$B$22:$R$103,2,0)=\"\",\"\",VLOOKUP($A33,'Entry form'!$B$22:$R$103,2,0)),\"\")","v":""},{"$f":"SUMIF('Entry form'!$C$22:$C$103,$B33,'Entry form'!$R$22:$R$103)","v":0},null,0]
[31,{"$f":"IFERROR(IF(VLOOKUP($A34,'Entry form'!$B$22:$R$103,2,0)=\"\",\"\",VLOOKUP($A34,'Entry form'!$B$22:$R$103,2,0)),\"\")","v":""},{"$f":"SUMIF('Entry form'!$C$22:$C$103,$B34,'Entry form'!$R$22:$R$103)","v":0},null,0]
[32,{"$f":"IFERROR(IF(VLOOKUP($A35,'Entry form'!$B$22:$R$103,2,0)=\"\",\"\",VLOOKUP($A35,'Entry form'!$B$22:$R$103,2,0)),\"\")","v":""},{"$f":"SUMIF('Entry form'!$C$22:$C$103,$B35,'Entry form'!$R$22:$R$103)","v":0},null,0]
[33,{"$f":"IFERROR(IF(VLOOKUP($A36,'Entry form'!$B$22:$R$103,2,0)=\"\",\"\",VLOOKUP($A36,'Entry form'!$B$22:$R$103,2,0)),\"\")","v":""},{"$f":"SUMIF('Entry form'!$C$22:$C$103,$B36,'Entry form'!$R$22:$R$103)","v":0},null,0]
[34,{"$f":"IFERROR(IF(VLOOKUP($A37,'Entry form'!$B$22:$R$103,2,0)=\"\",\"\",VLOOKUP($A37,'Entry form'!$B$22:$R$103,2,0)),\"\")","v":""},{"$f":"SUMIF('Entry form'!$C$22:$C$103,$B37,'Entry form'!$R$22:$R$103)","v":0},null,0]
[35,{"$f":"IFERROR(IF(VLOOKUP($A38,'Entry form'!$B$22:$R$103,2,0)=\"\",\"\",VLOOKUP($A38,'Entry form'!$B$22:$R$103,2,0)),\"\")","v":""},{"$f":"SUMIF('Entry form'!$C$22:$C$103,$B38,'Entry form'!$R$22:$R$103)","v":0},null,0]
[36,{"$f":"IFERROR(IF(VLOOKUP($A39,'Entry form'!$B$22:$R$103,2,0)=\"\",\"\",VLOOKUP($A39,'Entry form'!$B$22:$R$103,2,0)),\"\")","v":""},{"$f":"SUMIF('Entry form'!$C$22:$C$103,$B39,'Entry form'!$R$22:$R$103)","v":0},null,0]
[37,{"$f":"IFERROR(IF(VLOOKUP($A40,'Entry form'!$B$22:$R$103,2,0)=\"\",\"\",VLOOKUP($A40,'Entry form'!$B$22:$R$103,2,0)),\"\")","v":""},{"$f":"SUMIF('Entry form'!$C$22:$C$103,$B40,'Entry form'!$R$22:$R$103)","v":0},null,0]
[38,{"$f":"IFERROR(IF(VLOOKUP($A41,'Entry form'!$B$22:$R$103,2,0)=\"\",\"\",VLOOKUP($A41,'Entry form'!$B$22:$R$103,2,0)),\"\")","v":""},{"$f":"SUMIF('Entry form'!$C$22:$C$103,$B41,'Entry form'!$R$22:$R$103)","v":0},null,0]
[39,{"$f":"IFERROR(IF(VLOOKUP($A42,'Entry form'!$B$22:$R$103,2,0)=\"\",\"\",VLOOKUP($A42,'Entry form'!$B$22:$R$103,2,0)),\"\")","v":""},{"$f":"SUMIF('Entry form'!$C$22:$C$103,$B42,'Entry form'!$R$22:$R$103)","v":0},null,0]
[40,{"$f":"IFERROR(IF(VLOOKUP($A43,'Entry form'!$B$22:$R$103,2,0)=\"\",\"\",VLOOKUP($A43,'Entry form'!$B$22:$R$103,2,0)),\"\")","v":""},{"$f":"SUMIF('Entry form'!$C$22:$C$103,$B43,'Entry form'!$R$22:$R$103)","v":0},null,0]
[41,{"$f":"IFERROR(IF(VLOOKUP($A44,'Entry form'!$B$22:$R$103,2,0)=\"\",\"\",VLOOKUP($A44,'Entry form'!$B$22:$R$103,2,0)),\"\")","v":""},{"$f":"SUMIF('Entry form'!$C$22:$C$103,$B44,'Entry form'!$R$22:$R$103)","v":0},null,0]
[42,{"$f":"IFERROR(IF(VLOOKUP($A45,'Entry form'!$B$22:$R$103,2,0)=\"\",\"\",VLOOKUP($A45,'Entry form'!$B$22:$R$103,2,0)),\"\")","v":""},{"$f":"SUMIF('Entry form'!$C$22:$C$103,$B45,'Entry form'!$R$22:$R$103)","v":0},null,0]
[43,{"$f":"IFERROR(IF(VLOOKUP($A46,'Entry form'!$B$22:$R$103,2,0)=\"\",\"\",VLOOKUP($A46,'Entry form'!$B$22:$R$103,2,0)),\"\")","v":""},{"$f":"SUMIF('Entry form'!$C$22:$C$103,$B46,'Entry form'!$R$22:$R$103)","v":0},null,0]
[44,{"$f":"IFERROR(IF(VLOOKUP($A47,'Entry form'!$B$22:$R$103,2,0)=\"\",\"\",VLOOKUP($A47,'Entry form'!$B$22:$R$103,2,0)),\"\")","v":""},{"$f":"SUMIF('Entry form'!$C$22:$C$103,$B47,'Entry form'!$R$22:$R$103)","v":0},null,0]
[45,{"$f":"IFERROR(IF(VLOOKUP($A48,'Entry form'!$B$22:$R$103,2,0)=\"\",\"\",VLOOKUP($A48,'Entry form'!$B$22:$R$103,2,0)),\"\")","v":""},{"$f":"SUMIF('Entry form'!$C$22:$C$103,$B48,'Entry form'!$R$22:$R$103)","v":0},null,0]
[46,{"$f":"IFERROR(IF(VLOOKUP($A49,'Entry form'!$B$22:$R$103,2,0)=\"\",\"\",VLOOKUP($A49,'Entry form'!$B$22:$R$103,2,0)),\"\")","v":""},{"$f":"SUMIF('Entry form'!$C$22:$C$103,$B49,'Entry form'!$R$22:$R$103)","v":0},null,0]
[47,{"$f":"IFERROR(IF(VLOOKUP($A50,'Entry form'!$B$22:$R$103,2,0)=\"\",\"\",VLOOKUP($A50,'Entry form'!$B$22:$R$103,2,0)),\"\")","v":""},{"$f":"SUMIF('Entry form'!$C$22:$C$103,$B50,'Entry form'!$R$22:$R$103)","v":0},null,0]
[48,{"$f":"IFERROR(IF(VLOOKUP($A51,'Entry form'!$B$22:$R$103,2,0)=\"\",\"\",VLOOKUP($A51,'Entry form'!$B$22:$R$103,2,0)),\"\")","v":""},{"$f":"SUMIF('Entry form'!$C$22:$C$103,$B51,'Entry form'!$R$22:$R$103)","v":0},null,0]
[49,{"$f":"IFERROR(IF(VLOOKUP($A52,'Entry form'!$B$22:$R$103,2,0)=\"\",\"\",VLOOKUP($A52,'Entry form'!$B$22:$R$103,2,0)),\"\")","v":""},{"$f":"SUMIF('Entry form'!$C$22:$C$103,$B52,'Entry form'!$R$22:$R$103)","v":0},null,0]
[50,{"$f":"IFERROR(IF(VLOOKUP($A53,'Entry form'!$B$22:$R$103,2,0)=\"\",\"\",VLOOKUP($A53,'Entry form'!$B$22:$R$103,2,0)),\"\")","v":""},{"$f":"SUMIF('Entry form'!$C$22:$C$103,$B53,'Entry form'!$R$22:$R$103)","v":0},null,0]
[51,{"$f":"IFERROR(IF(VLOOKUP($A54,'Entry form'!$B$22:$R$103,2,0)=\"\",\"\",VLOOKUP($A54,'Entry form'!$B$22:$R$103,2,0)),\"\")","v":""},{"$f":"SUMIF('Entry form'!$C$22:$C$103,$B54,'Entry form'!$R$22:$R$103)","v":0},null,0]
[52,{"$f":"IFERROR(IF(VLOOKUP($A55,'Entry form'!$B$22:$R$103,2,0)=\"\",\"\",VLOOKUP($A55,'Entry form'!$B$22:$R$103,2,0)),\"\")","v":""},{"$f":"SUMIF('Entry form'!$C$22:$C$103,$B55,'Entry form'!$R$22:$R$103)","v":0},null,0]
[53,{"$f":"IFERROR(IF(VLOOKUP($A56,'Entry form'!$B$22:$R$103,2,0)=\"\",\"\",VLOOKUP($A56,'Entry form'!$B$22:$R$103,2,0)),\"\")","v":""},{"$f":"SUMIF('Entry form'!$C$22:$C$103,$B56,'Entry form'!$R$22:$R$103)","v":0},null,0]
[54,{"$f":"IFERROR(IF(VLOOKUP($A57,'Entry form'!$B$22:$R$103,2,0)=\"\",\"\",VLOOKUP($A57,'Entry form'!$B$22:$R$103,2,0)),\"\")","v":""},{"$f":"SUMIF('Entry form'!$C$22:$C$103,$B57,'Entry form'!$R$22:$R$103)","v":0},null,0]
[55,{"$f":"IFERROR(IF(VLOOKUP($A58,'Entry form'!$B$22:$R$103,2,0)=\"\",\"\",VLOOKUP($A58,'Entry form'!$B$22:$R$103,2,0)),\"\")","v":""},{"$f":"SUMIF('Entry form'!$C$22:$C$103,$B58,'Entry form'!$R$22:$R$103)","v":0},null,0]
[56,{"$f":"IFERROR(IF(VLOOKUP($A59,'Entry form'!$B$22:$R$103,2,0)=\"\",\"\",VLOOKUP($A59,'Entry form'!$B$22:$R$103,2,0)),\"\")","v":""},{"$f":"SUMIF('Entry form'!$C$22:$C$103,$B59,'Entry form'!$R$22:$R$103)","v":0},null,0]
[57,{"$f":"IFERROR(IF(VLOOKUP($A60,'Entry form'!$B$22:$R$103,2,0)=\"\",\"\",VLOOKUP($A60,'Entry form'!$B$22:$R$103,2,0)),\"\")","v":""},{"$f":"SUMIF('Entry form'!$C$22:$C$103,$B60,'Entry form'!$R$22:$R$103)","v":0},null,0]
[58,{"$f":"IFERROR(IF(VLOOKUP($A61,'Entry form'!$B$22:$R$103,2,0)=\"\",\"\",VLOOKUP($A61,'Entry form'!$B$22:$R$103,2,0)),\"\")","v":""},{"$f":"SUMIF('Entry form'!$C$22:$C$103,$B61,'Entry form'!$R$22:$R$103)","v":0},null,0]
[59,{"$f":"IFERROR(IF(VLOOKUP($A62,'Entry form'!$B$22:$R$103,2,0)=\"\",\"\",VLOOKUP($A62,'Entry form'!$B$22:$R$103,2,0)),\"\")","v":""},{"$f":"SUMIF('Entry form'!$C$22:$C$103,$B62,'Entry form'!$R$22:$R$103)","v":0},null,0]
[60,{"$f":"IFERROR(IF(VLOOKUP($A63,'Entry form'!$B$22:$R$103,2,0)=\"\",\"\",VLOOKUP($A63,'Entry form'!$B$22:$R$103,2,0)),\"\")","v":""},{"$f":"SUMIF('Entry form'!$C$22:$C$103,$B63,'Entry form'!$R$22:$R$103)","v":0},null,0]
[61,{"$f":"IFERROR(IF(VLOOKUP($A64,'Entry form'!$B$22:$R$103,2,0)=\"\",\"\",VLOOKUP($A64,'Entry form'!$B$22:$R$103,2,0)),\"\")","v":""},{"$f":"SUMIF('Entry form'!$C$22:$C$103,$B64,'Entry form'!$R$22:$R$103)","v":0},null,0]
[62,{"$f":"IFERROR(IF(VLOOKUP($A65,'Entry form'!$B$22:$R$103,2,0)=\"\",\"\",VLOOKUP($A65,'Entry form'!$B$22:$R$103,2,0)),\"\")","v":""},{"$f":"SUMIF('Entry form'!$C$22:$C$103,$B65,'Entry form'!$R$22:$R$103)","v":0},null,0]
[63,{"$f":"IFERROR(IF(VLOOKUP($A66,'Entry form'!$B$22:$R$103,2,0)=\"\",\"\",VLOOKUP($A66,'Entry form'!$B$22:$R$103,2,0)),\"\")","v":""},{"$f":"SUMIF('Entry form'!$C$22:$C$103,$B66,'Entry form'!$R$22:$R$103)","v":0},null,0]
[64,{"$f":"IFERROR(IF(VLOOKUP($A67,'Entry form'!$B$22:$R$103,2,0)=\"\",\"\",VLOOKUP($A67,'Entry form'!$B$22:$R$103,2,0)),\"\")","v":""},{"$f":"SUMIF('Entry form'!$C$22:$C$103,$B67,'Entry form'!$R$22:$R$103)","v":0},null,0]
[65,{"$f":"IFERROR(IF(VLOOKUP($A68,'Entry form'!$B$22:$R$103,2,0)=\"\",\"\",VLOOKUP($A68,'Entry form'!$B$22:$R$103,2,0)),\"\")","v":""},{"$f":"SUMIF('Entry form'!$C$22:$C$103,$B68,'Entry form'!$R$22:$R$103)","v":0},null,0]
[66,{"$f":"IFERROR(IF(VLOOKUP($A69,'Entry form'!$B$22:$R$103,2,0)=\"\",\"\",VLOOKUP($A69,'Entry form'!$B$22:$R$103,2,0)),\"\")","v":""},{"$f":"SUMIF('Entry form'!$C$22:$C$103,$B69,'Entry form'!$R$22:$R$103)","v":0},null,{"$f":"IF(C69=\"\",\"\",C69-D69)","v":0}]
[{"$f":"+A69+1","v":67},{"$f":"IFERROR(IF(VLOOKUP($A70,'Entry form'!$B$22:$R$103,2,0)=\"\",\"\",VLOOKUP($A70,'Entry form'!$B$22:$R$103,2,0)),\"\")","v":""},{"$f":"SUMIF('Entry form'!$C$22:$C$103,$B70,'Entry form'!$R$22:$R$103)","v":0},null,0]
[68,{"$f":"IFERROR(IF(VLOOKUP($A71,'Entry form'!$B$22:$R$103,2,0)=\"\",\"\",VLOOKUP($A71,'Entry form'!$B$22:$R$103,2,0)),\"\")","v":""},{"$f":"SUMIF('Entry form'!$C$22:$C$103,$B71,'Entry form'!$R$22:$R$103)","v":0},null,0]
[69,{"$f":"IFERROR(IF(VLOOKUP($A72,'Entry form'!$B$22:$R$103,2,0)=\"\",\"\",VLOOKUP($A72,'Entry form'!$B$22:$R$103,2,0)),\"\")","v":""},{"$f":"SUMIF('Entry form'!$C$22:$C$103,$B72,'Entry form'!$R$22:$R$103)","v":0},null,0]
[70,{"$f":"IFERROR(IF(VLOOKUP($A73,'Entry form'!$B$22:$R$103,2,0)=\"\",\"\",VLOOKUP($A73,'Entry form'!$B$22:$R$103,2,0)),\"\")","v":""},{"$f":"SUMIF('Entry form'!$C$22:$C$103,$B73,'Entry form'!$R$22:$R$103)","v":0},null,0]
[71,{"$f":"IFERROR(IF(VLOOKUP($A74,'Entry form'!$B$22:$R$103,2,0)=\"\",\"\",VLOOKUP($A74,'Entry form'!$B$22:$R$103,2,0)),\"\")","v":""},{"$f":"SUMIF('Entry form'!$C$22:$C$103,$B74,'Entry form'!$R$22:$R$103)","v":0},null,0]
[72,{"$f":"IFERROR(IF(VLOOKUP($A75,'Entry form'!$B$22:$R$103,2,0)=\"\",\"\",VLOOKUP($A75,'Entry form'!$B$22:$R$103,2,0)),\"\")","v":""},{"$f":"SUMIF('Entry form'!$C$22:$C$103,$B75,'Entry form'!$R$22:$R$103)","v":0},null,0]
[73,{"$f":"IFERROR(IF(VLOOKUP($A76,'Entry form'!$B$22:$R$103,2,0)=\"\",\"\",VLOOKUP($A76,'Entry form'!$B$22:$R$103,2,0)),\"\")","v":""},{"$f":"SUMIF('Entry form'!$C$22:$C$103,$B76,'Entry form'!$R$22:$R$103)","v":0},null,0]
[74,{"$f":"IFERROR(IF(VLOOKUP($A77,'Entry form'!$B$22:$R$103,2,0)=\"\",\"\",VLOOKUP($A77,'Entry form'!$B$22:$R$103,2,0)),\"\")","v":""},{"$f":"SUMIF('Entry form'!$C$22:$C$103,$B77,'Entry form'!$R$22:$R$103)","v":0},null,0]
[75,{"$f":"IFERROR(IF(VLOOKUP($A78,'Entry form'!$B$22:$R$103,2,0)=\"\",\"\",VLOOKUP($A78,'Entry form'!$B$22:$R$103,2,0)),\"\")","v":""},{"$f":"SUMIF('Entry form'!$C$22:$C$103,$B78,'Entry form'!$R$22:$R$103)","v":0},null,0]
[76,{"$f":"IFERROR(IF(VLOOKUP($A79,'Entry form'!$B$22:$R$103,2,0)=\"\",\"\",VLOOKUP($A79,'Entry form'!$B$22:$R$103,2,0)),\"\")","v":""},{"$f":"SUMIF('Entry form'!$C$22:$C$103,$B79,'Entry form'!$R$22:$R$103)","v":0},null,0]
[77,{"$f":"IFERROR(IF(VLOOKUP($A80,'Entry form'!$B$22:$R$103,2,0)=\"\",\"\",VLOOKUP($A80,'Entry form'!$B$22:$R$103,2,0)),\"\")","v":""},{"$f":"SUMIF('Entry form'!$C$22:$C$103,$B80,'Entry form'!$R$22:$R$103)","v":0},null,0]
[78,{"$f":"IFERROR(IF(VLOOKUP($A81,'Entry form'!$B$22:$R$103,2,0)=\"\",\"\",VLOOKUP($A81,'Entry form'!$B$22:$R$103,2,0)),\"\")","v":""},{"$f":"SUMIF('Entry form'!$C$22:$C$103,$B81,'Entry form'!$R$22:$R$103)","v":0},null,0]
[79,{"$f":"IFERROR(IF(VLOOKUP($A82,'Entry form'!$B$22:$R$103,2,0)=\"\",\"\",VLOOKUP($A82,'Entry form'!$B$22:$R$103,2,0)),\"\")","v":""},{"$f":"SUMIF('Entry form'!$C$22:$C$103,$B82,'Entry form'!$R$22:$R$103)","v":0},null,0]
[80,{"$f":"IFERROR(IF(VLOOKUP($A83,'Entry form'!$B$22:$R$103,2,0)=\"\",\"\",VLOOKUP($A83,'Entry form'!$B$22:$R$103,2,0)),\"\")","v":""},{"$f":"SUMIF('Entry form'!$C$22:$C$103,$B83,'Entry form'!$R$22:$R$103)","v":0},null,0]
[81,{"$f":"IFERROR(IF(VLOOKUP($A84,'Entry form'!$B$22:$R$103,2,0)=\"\",\"\",VLOOKUP($A84,'Entry form'!$B$22:$R$103,2,0)),\"\")","v":""},{"$f":"SUMIF('Entry form'!$C$22:$C$103,$B84,'Entry form'!$R$22:$R$103)","v":0},null,0]
[82,{"$f":"IFERROR(IF(VLOOKUP($A85,'Entry form'!$B$22:$R$103,2,0)=\"\",\"\",VLOOKUP($A85,'Entry form'!$B$22:$R$103,2,0)),\"\")","v":""},{"$f":"SUMIF('Entry form'!$C$22:$C$103,$B85,'Entry form'!$R$22:$R$103)","v":0},null,0]
[83,{"$f":"IFERROR(IF(VLOOKUP($A86,'Entry form Page 2'!$B$22:$R$103,2,0)=\"\",\"\",VLOOKUP($A86,'Entry form Page 2'!$B$22:$R$103,2,0)),\"\")","v":""},{"$f":"SUMIF('Entry form Page 2'!$C$22:$C$103,$B86,'Entry form Page 2'!$R$22:$R$103)","v":0},null,{"$f":"IF(C86=\"\",\"\",C86-D86)","v":0}]
[84,{"$f":"IFERROR(IF(VLOOKUP($A87,'Entry form Page 2'!$B$22:$R$103,2,0)=\"\",\"\",VLOOKUP($A87,'Entry form Page 2'!$B$22:$R$103,2,0)),\"\")","v":""},{"$f":"SUMIF('Entry form Page 2'!$C$22:$C$103,$B87,'Entry form Page 2'!$R$22:$R$103)","v":0},null,0]
[85,{"$f":"IFERROR(IF(VLOOKUP($A88,'Entry form Page 2'!$B$22:$R$103,2,0)=\"\",\"\",VLOOKUP($A88,'Entry form Page 2'!$B$22:$R$103,2,0)),\"\")","v":""},{"$f":"SUMIF('Entry form Page 2'!$C$22:$C$103,$B88,'Entry form Page 2'!$R$22:$R$103)","v":0},null,0]
[86,{"$f":"IFERROR(IF(VLOOKUP($A89,'Entry form Page 2'!$B$22:$R$103,2,0)=\"\",\"\",VLOOKUP($A89,'Entry form Page 2'!$B$22:$R$103,2,0)),\"\")","v":""},{"$f":"SUMIF('Entry form Page 2'!$C$22:$C$103,$B89,'Entry form Page 2'!$R$22:$R$103)","v":0},null,0]
[87,{"$f":"IFERROR(IF(VLOOKUP($A90,'Entry form Page 2'!$B$22:$R$103,2,0)=\"\",\"\",VLOOKUP($A90,'Entry form Page 2'!$B$22:$R$103,2,0)),\"\")","v":""},{"$f":"SUMIF('Entry form Page 2'!$C$22:$C$103,$B90,'Entry form Page 2'!$R$22:$R$103)","v":0},null,0]
[88,{"$f":"IFERROR(IF(VLOOKUP($A91,'Entry form Page 2'!$B$22:$R$103,2,0)=\"\",\"\",VLOOKUP($A91,'Entry form Page 2'!$B$22:$R$103,2,0)),\"\")","v":""},{"$f":"SUMIF('Entry form Page 2'!$C$22:$C$103,$B91,'Entry form Page 2'!$R$22:$R$103)","v":0},null,0]
[89,{"$f":"IFERROR(IF(VLOOKUP($A92,'Entry form Page 2'!$B$22:$R$103,2,0)=\"\",\"\",VLOOKUP($A92,'Entry form Page 2'!$B$22:$R$103,2,0)),\"\")","v":""},{"$f":"SUMIF('Entry form Page 2'!$C$22:$C$103,$B92,'Entry form Page 2'!$R$22:$R$103)","v":0},null,0]
[90,{"$f":"IFERROR(IF(VLOOKUP($A93,'Entry form Page 2'!$B$22:$R$103,2,0)=\"\",\"\",VLOOKUP($A93,'Entry form Page 2'!$B$22:$R$103,2,0)),\"\")","v":""},{"$f":"SUMIF('Entry form Page 2'!$C$22:$C$103,$B93,'Entry form Page 2'!$R$22:$R$103)","v":0},null,0]
[91,{"$f":"IFERROR(IF(VLOOKUP($A94,'Entry form Page 2'!$B$22:$R$103,2,0)=\"\",\"\",VLOOKUP($A94,'Entry form Page 2'!$B$22:$R$103,2,0)),\"\")","v":""},{"$f":"SUMIF('Entry form Page 2'!$C$22:$C$103,$B94,'Entry form Page 2'!$R$22:$R$103)","v":0},null,0]
[92,{"$f":"IFERROR(IF(VLOOKUP($A95,'Entry form Page 2'!$B$22:$R$103,2,0)=\"\",\"\",VLOOKUP($A95,'Entry form Page 2'!$B$22:$R$103,2,0)),\"\")","v":""},{"$f":"SUMIF('Entry form Page 2'!$C$22:$C$103,$B95,'Entry form Page 2'!$R$22:$R$103)","v":0},null,0]
[93,{"$f":"IFERROR(IF(VLOOKUP($A96,'Entry form Page 2'!$B$22:$R$103,2,0)=\"\",\"\",VLOOKUP($A96,'Entry form Page 2'!$B$22:$R$103,2,0)),\"\")","v":""},{"$f":"SUMIF('Entry form Page 2'!$C$22:$C$103,$B96,'Entry form Page 2'!$R$22:$R$103)","v":0},null,0]
[94,{"$f":"IFERROR(IF(VLOOKUP($A97,'Entry form Page 2'!$B$22:$R$103,2,0)=\"\",\"\",VLOOKUP($A97,'Entry form Page 2'!$B$22:$R$103,2,0)),\"\")","v":""},{"$f":"SUMIF('Entry form Page 2'!$C$22:$C$103,$B97,'Entry form Page 2'!$R$22:$R$103)","v":0},null,0]
[95,{"$f":"IFERROR(IF(VLOOKUP($A98,'Entry form Page 2'!$B$22:$R$103,2,0)=\"\",\"\",VLOOKUP($A98,'Entry form Page 2'!$B$22:$R$103,2,0)),\"\")","v":""},{"$f":"SUMIF('Entry form Page 2'!$C$22:$C$103,$B98,'Entry form Page 2'!$R$22:$R$103)","v":0},null,0]
[96,{"$f":"IFERROR(IF(VLOOKUP($A99,'Entry form Page 2'!$B$22:$R$103,2,0)=\"\",\"\",VLOOKUP($A99,'Entry form Page 2'!$B$22:$R$103,2,0)),\"\")","v":""},{"$f":"SUMIF('Entry form Page 2'!$C$22:$C$103,$B99,'Entry form Page 2'!$R$22:$R$103)","v":0},null,0]
[97,{"$f":"IFERROR(IF(VLOOKUP($A100,'Entry form Page 2'!$B$22:$R$103,2,0)=\"\",\"\",VLOOKUP($A100,'Entry form Page 2'!$B$22:$R$103,2,0)),\"\")","v":""},{"$f":"SUMIF('Entry form Page 2'!$C$22:$C$103,$B100,'Entry form Page 2'!$R$22:$R$103)","v":0},null,0]
[98,{"$f":"IFERROR(IF(VLOOKUP($A101,'Entry form Page 2'!$B$22:$R$103,2,0)=\"\",\"\",VLOOKUP($A101,'Entry form Page 2'!$B$22:$R$103,2,0)),\"\")","v":""},{"$f":"SUMIF('Entry form Page 2'!$C$22:$C$103,$B101,'Entry form Page 2'!$R$22:$R$103)","v":0},null,0]
[99,{"$f":"IFERROR(IF(VLOOKUP($A102,'Entry form Page 2'!$B$22:$R$103,2,0)=\"\",\"\",VLOOKUP($A102,'Entry form Page 2'!$B$22:$R$103,2,0)),\"\")","v":""},{"$f":"SUMIF('Entry form Page 2'!$C$22:$C$103,$B102,'Entry form Page 2'!$R$22:$R$103)","v":0},null,0]
[100,{"$f":"IFERROR(IF(VLOOKUP($A103,'Entry form Page 2'!$B$22:$R$103,2,0)=\"\",\"\",VLOOKUP($A103,'Entry form Page 2'!$B$22:$R$103,2,0)),\"\")","v":""},{"$f":"SUMIF('Entry form Page 2'!$C$22:$C$103,$B103,'Entry form Page 2'!$R$22:$R$103)","v":0},null,0]
[101,{"$f":"IFERROR(IF(VLOOKUP($A104,'Entry form Page 2'!$B$22:$R$103,2,0)=\"\",\"\",VLOOKUP($A104,'Entry form Page 2'!$B$22:$R$103,2,0)),\"\")","v":""},{"$f":"SUMIF('Entry form Page 2'!$C$22:$C$103,$B104,'Entry form Page 2'!$R$22:$R$103)","v":0},null,0]
[102,{"$f":"IFERROR(IF(VLOOKUP($A105,'Entry form Page 2'!$B$22:$R$103,2,0)=\"\",\"\",VLOOKUP($A105,'Entry form Page 2'!$B$22:$R$103,2,0)),\"\")","v":""},{"$f":"SUMIF('Entry form Page 2'!$C$22:$C$103,$B105,'Entry form Page 2'!$R$22:$R$103)","v":0},null,0]
[103,{"$f":"IFERROR(IF(VLOOKUP($A106,'Entry form Page 2'!$B$22:$R$103,2,0)=\"\",\"\",VLOOKUP($A106,'Entry form Page 2'!$B$22:$R$103,2,0)),\"\")","v":""},{"$f":"SUMIF('Entry form Page 2'!$C$22:$C$103,$B106,'Entry form Page 2'!$R$22:$R$103)","v":0},null,0]
[104,{"$f":"IFERROR(IF(VLOOKUP($A107,'Entry form Page 2'!$B$22:$R$103,2,0)=\"\",\"\",VLOOKUP($A107,'Entry form Page 2'!$B$22:$R$103,2,0)),\"\")","v":""},{"$f":"SUMIF('Entry form Page 2'!$C$22:$C$103,$B107,'Entry form Page 2'!$R$22:$R$103)","v":0},null,0]
[105,{"$f":"IFERROR(IF(VLOOKUP($A108,'Entry form Page 2'!$B$22:$R$103,2,0)=\"\",\"\",VLOOKUP($A108,'Entry form Page 2'!$B$22:$R$103,2,0)),\"\")","v":""},{"$f":"SUMIF('Entry form Page 2'!$C$22:$C$103,$B108,'Entry form Page 2'!$R$22:$R$103)","v":0},null,0]
[106,{"$f":"IFERROR(IF(VLOOKUP($A109,'Entry form Page 2'!$B$22:$R$103,2,0)=\"\",\"\",VLOOKUP($A109,'Entry form Page 2'!$B$22:$R$103,2,0)),\"\")","v":""},{"$f":"SUMIF('Entry form Page 2'!$C$22:$C$103,$B109,'Entry form Page 2'!$R$22:$R$103)","v":0},null,0]
[107,{"$f":"IFERROR(IF(VLOOKUP($A110,'Entry form Page 2'!$B$22:$R$103,2,0)=\"\",\"\",VLOOKUP($A110,'Entry form Page 2'!$B$22:$R$103,2,0)),\"\")","v":""},{"$f":"SUMIF('Entry form Page 2'!$C$22:$C$103,$B110,'Entry form Page 2'!$R$22:$R$103)","v":0},null,0]
[108,{"$f":"IFERROR(IF(VLOOKUP($A111,'Entry form Page 2'!$B$22:$R$103,2,0)=\"\",\"\",VLOOKUP($A111,'Entry form Page 2'!$B$22:$R$103,2,0)),\"\")","v":""},{"$f":"SUMIF('Entry form Page 2'!$C$22:$C$103,$B111,'Entry form Page 2'!$R$22:$R$103)","v":0},null,0]
[109,{"$f":"IFERROR(IF(VLOOKUP($A112,'Entry form Page 2'!$B$22:$R$103,2,0)=\"\",\"\",VLOOKUP($A112,'Entry form Page 2'!$B$22:$R$103,2,0)),\"\")","v":""},{"$f":"SUMIF('Entry form Page 2'!$C$22:$C$103,$B112,'Entry form Page 2'!$R$22:$R$103)","v":0},null,0]
[110,{"$f":"IFERROR(IF(VLOOKUP($A113,'Entry form Page 2'!$B$22:$R$103,2,0)=\"\",\"\",VLOOKUP($A113,'Entry form Page 2'!$B$22:$R$103,2,0)),\"\")","v":""},{"$f":"SUMIF('Entry form Page 2'!$C$22:$C$103,$B113,'Entry form Page 2'!$R$22:$R$103)","v":0},null,0]
[111,{"$f":"IFERROR(IF(VLOOKUP($A114,'Entry form Page 2'!$B$22:$R$103,2,0)=\"\",\"\",VLOOKUP($A114,'Entry form Page 2'!$B$22:$R$103,2,0)),\"\")","v":""},{"$f":"SUMIF('Entry form Page 2'!$C$22:$C$103,$B114,'Entry form Page 2'!$R$22:$R$103)","v":0},null,0]
[112,{"$f":"IFERROR(IF(VLOOKUP($A115,'Entry form Page 2'!$B$22:$R$103,2,0)=\"\",\"\",VLOOKUP($A115,'Entry form Page 2'!$B$22:$R$103,2,0)),\"\")","v":""},{"$f":"SUMIF('Entry form Page 2'!$C$22:$C$103,$B115,'Entry form Page 2'!$R$22:$R$103)","v":0},null,0]
[113,{"$f":"IFERROR(IF(VLOOKUP($A116,'Entry form Page 2'!$B$22:$R$103,2,0)=\"\",\"\",VLOOKUP($A116,'Entry form Page 2'!$B$22:$R$103,2,0)),\"\")","v":""},{"$f":"SUMIF('Entry form Page 2'!$C$22:$C$103,$B116,'Entry form Page 2'!$R$22:$R$103)","v":0},null,0]
[114,{"$f":"IFERROR(IF(VLOOKUP($A117,'Entry form Page 2'!$B$22:$R$103,2,0)=\"\",\"\",VLOOKUP($A117,'Entry form Page 2'!$B$22:$R$103,2,0)),\"\")","v":""},{"$f":"SUMIF('Entry form Page 2'!$C$22:$C$103,$B117,'Entry form Page 2'!$R$22:$R$103)","v":0},null,0]
[115,{"$f":"IFERROR(IF(VLOOKUP($A118,'Entry form Page 2'!$B$22:$R$103,2,0)=\"\",\"\",VLOOKUP($A118,'Entry form Page 2'!$B$22:$R$103,2,0)),\"\")","v":""},{"$f":"SUMIF('Entry form Page 2'!$C$22:$C$103,$B118,'Entry form Page 2'!$R$22:$R$103)","v":0},null,0]
[116,{"$f":"IFERROR(IF(VLOOKUP($A119,'Entry form Page 2'!$B$22:$R$103,2,0)=\"\",\"\",VLOOKUP($A119,'Entry form Page 2'!$B$22:$R$103,2,0)),\"\")","v":""},{"$f":"SUMIF('Entry form Page 2'!$C$22:$C$103,$B119,'Entry form Page 2'!$R$22:$R$103)","v":0},null,0]
[117,{"$f":"IFERROR(IF(VLOOKUP($A120,'Entry form Page 2'!$B$22:$R$103,2,0)=\"\",\"\",VLOOKUP($A120,'Entry form Page 2'!$B$22:$R$103,2,0)),\"\")","v":""},{"$f":"SUMIF('Entry form Page 2'!$C$22:$C$103,$B120,'Entry form Page 2'!$R$22:$R$103)","v":0},null,0]
[118,{"$f":"IFERROR(IF(VLOOKUP($A121,'Entry form Page 2'!$B$22:$R$103,2,0)=\"\",\"\",VLOOKUP($A121,'Entry form Page 2'!$B$22:$R$103,2,0)),\"\")","v":""},{"$f":"SUMIF('Entry form Page 2'!$C$22:$C$103,$B121,'Entry form Page 2'!$R$22:$R$103)","v":0},null,0]
[119,{"$f":"IFERROR(IF(VLOOKUP($A122,'Entry form Page 2'!$B$22:$R$103,2,0)=\"\",\"\",VLOOKUP($A122,'Entry form Page 2'!$B$22:$R$103,2,0)),\"\")","v":""},{"$f":"SUMIF('Entry form Page 2'!$C$22:$C$103,$B122,'Entry form Page 2'!$R$22:$R$103)","v":0},null,0]
[120,{"$f":"IFERROR(IF(VLOOKUP($A123,'Entry form Page 2'!$B$22:$R$103,2,0)=\"\",\"\",VLOOKUP($A123,'Entry form Page 2'!$B$22:$R$103,2,0)),\"\")","v":""},{"$f":"SUMIF('Entry form Page 2'!$C$22:$C$103,$B123,'Entry form Page 2'!$R$22:$R$103)","v":0},null,0]
[121,{"$f":"IFERROR(IF(VLOOKUP($A124,'Entry form Page 2'!$B$22:$R$103,2,0)=\"\",\"\",VLOOKUP($A124,'Entry form Page 2'!$B$22:$R$103,2,0)),\"\")","v":""},{"$f":"SUMIF('Entry form Page 2'!$C$22:$C$103,$B124,'Entry form Page 2'!$R$22:$R$103)","v":0},null,0]
[122,{"$f":"IFERROR(IF(VLOOKUP($A125,'Entry form Page 2'!$B$22:$R$103,2,0)=\"\",\"\",VLOOKUP($A125,'Entry form Page 2'!$B$22:$R$103,2,0)),\"\")","v":""},{"$f":"SUMIF('Entry form Page 2'!$C$22:$C$103,$B125,'Entry form Page 2'!$R$22:$R$103)","v":0},null,0]
[123,{"$f":"IFERROR(IF(VLOOKUP($A126,'Entry form Page 2'!$B$22:$R$103,2,0)=\"\",\"\",VLOOKUP($A126,'Entry form Page 2'!$B$22:$R$103,2,0)),\"\")","v":""},{"$f":"SUMIF('Entry form Page 2'!$C$22:$C$103,$B126,'Entry form Page 2'!$R$22:$R$103)","v":0},null,0]
[124,{"$f":"IFERROR(IF(VLOOKUP($A127,'Entry form Page 2'!$B$22:$R$103,2,0)=\"\",\"\",VLOOKUP($A127,'Entry form Page 2'!$B$22:$R$103,2,0)),\"\")","v":""},{"$f":"SUMIF('Entry form Page 2'!$C$22:$C$103,$B127,'Entry form Page 2'!$R$22:$R$103)","v":0},null,0]
[125,{"$f":"IFERROR(IF(VLOOKUP($A128,'Entry form Page 2'!$B$22:$R$103,2,0)=\"\",\"\",VLOOKUP($A128,'Entry form Page 2'!$B$22:$R$103,2,0)),\"\")","v":""},{"$f":"SUMIF('Entry form Page 2'!$C$22:$C$103,$B128,'Entry form Page 2'!$R$22:$R$103)","v":0},null,0]
[126,{"$f":"IFERROR(IF(VLOOKUP($A129,'Entry form Page 2'!$B$22:$R$103,2,0)=\"\",\"\",VLOOKUP($A129,'Entry form Page 2'!$B$22:$R$103,2,0)),\"\")","v":""},{"$f":"SUMIF('Entry form Page 2'!$C$22:$C$103,$B129,'Entry form Page 2'!$R$22:$R$103)","v":0},null,0]
[127,{"$f":"IFERROR(IF(VLOOKUP($A130,'Entry form Page 2'!$B$22:$R$103,2,0)=\"\",\"\",VLOOKUP($A130,'Entry form Page 2'!$B$22:$R$103,2,0)),\"\")","v":""},{"$f":"SUMIF('Entry form Page 2'!$C$22:$C$103,$B130,'Entry form Page 2'!$R$22:$R$103)","v":0},null,0]
[128,{"$f":"IFERROR(IF(VLOOKUP($A131,'Entry form Page 2'!$B$22:$R$103,2,0)=\"\",\"\",VLOOKUP($A131,'Entry form Page 2'!$B$22:$R$103,2,0)),\"\")","v":""},{"$f":"SUMIF('Entry form Page 2'!$C$22:$C$103,$B131,'Entry form Page 2'!$R$22:$R$103)","v":0},null,0]
[129,{"$f":"IFERROR(IF(VLOOKUP($A132,'Entry form Page 2'!$B$22:$R$103,2,0)=\"\",\"\",VLOOKUP($A132,'Entry form Page 2'!$B$22:$R$103,2,0)),\"\")","v":""},{"$f":"SUMIF('Entry form Page 2'!$C$22:$C$103,$B132,'Entry form Page 2'!$R$22:$R$103)","v":0},null,0]
[130,{"$f":"IFERROR(IF(VLOOKUP($A133,'Entry form Page 2'!$B$22:$R$103,2,0)=\"\",\"\",VLOOKUP($A133,'Entry form Page 2'!$B$22:$R$103,2,0)),\"\")","v":""},{"$f":"SUMIF('Entry form Page 2'!$C$22:$C$103,$B133,'Entry form Page 2'!$R$22:$R$103)","v":0},null,0]
[{"$f":"+A133+1","v":131},{"$f":"IFERROR(IF(VLOOKUP($A134,'Entry form Page 2'!$B$22:$R$103,2,0)=\"\",\"\",VLOOKUP($A134,'Entry form Page 2'!$B$22:$R$103,2,0)),\"\")","v":""},{"$f":"SUMIF('Entry form Page 2'!$C$22:$C$103,$B134,'Entry form Page 2'!$R$22:$R$103)","v":0},null,0]
[132,{"$f":"IFERROR(IF(VLOOKUP($A135,'Entry form Page 2'!$B$22:$R$103,2,0)=\"\",\"\",VLOOKUP($A135,'Entry form Page 2'!$B$22:$R$103,2,0)),\"\")","v":""},{"$f":"SUMIF('Entry form Page 2'!$C$22:$C$103,$B135,'Entry form Page 2'!$R$22:$R$103)","v":0},null,{"$f":"IF(C135=\"\",\"\",C135-D135)","v":0}]
[133,{"$f":"IFERROR(IF(VLOOKUP($A136,'Entry form Page 2'!$B$22:$R$103,2,0)=\"\",\"\",VLOOKUP($A136,'Entry form Page 2'!$B$22:$R$103,2,0)),\"\")","v":""},{"$f":"SUMIF('Entry form Page 2'!$C$22:$C$103,$B136,'Entry form Page 2'!$R$22:$R$103)","v":0},null,0]
[134,{"$f":"IFERROR(IF(VLOOKUP($A137,'Entry form Page 2'!$B$22:$R$103,2,0)=\"\",\"\",VLOOKUP($A137,'Entry form Page 2'!$B$22:$R$103,2,0)),\"\")","v":""},{"$f":"SUMIF('Entry form Page 2'!$C$22:$C$103,$B137,'Entry form Page 2'!$R$22:$R$103)","v":0},null,0]
[135,{"$f":"IFERROR(IF(VLOOKUP($A138,'Entry form Page 2'!$B$22:$R$103,2,0)=\"\",\"\",VLOOKUP($A138,'Entry form Page 2'!$B$22:$R$103,2,0)),\"\")","v":""},{"$f":"SUMIF('Entry form Page 2'!$C$22:$C$103,$B138,'Entry form Page 2'!$R$22:$R$103)","v":0},null,0]
[136,{"$f":"IFERROR(IF(VLOOKUP($A139,'Entry form Page 2'!$B$22:$R$103,2,0)=\"\",\"\",VLOOKUP($A139,'Entry form Page 2'!$B$22:$R$103,2,0)),\"\")","v":""},{"$f":"SUMIF('Entry form Page 2'!$C$22:$C$103,$B139,'Entry form Page 2'!$R$22:$R$103)","v":0},null,0]
[137,{"$f":"IFERROR(IF(VLOOKUP($A140,'Entry form Page 2'!$B$22:$R$103,2,0)=\"\",\"\",VLOOKUP($A140,'Entry form Page 2'!$B$22:$R$103,2,0)),\"\")","v":""},{"$f":"SUMIF('Entry form Page 2'!$C$22:$C$103,$B140,'Entry form Page 2'!$R$22:$R$103)","v":0},null,0]
[138,{"$f":"IFERROR(IF(VLOOKUP($A141,'Entry form Page 2'!$B$22:$R$103,2,0)=\"\",\"\",VLOOKUP($A141,'Entry form Page 2'!$B$22:$R$103,2,0)),\"\")","v":""},{"$f":"SUMIF('Entry form Page 2'!$C$22:$C$103,$B141,'Entry form Page 2'!$R$22:$R$103)","v":0},null,0]
[139,{"$f":"IFERROR(IF(VLOOKUP($A142,'Entry form Page 2'!$B$22:$R$103,2,0)=\"\",\"\",VLOOKUP($A142,'Entry form Page 2'!$B$22:$R$103,2,0)),\"\")","v":""},{"$f":"SUMIF('Entry form Page 2'!$C$22:$C$103,$B142,'Entry form Page 2'!$R$22:$R$103)","v":0},null,0]
[140,{"$f":"IFERROR(IF(VLOOKUP($A143,'Entry form Page 2'!$B$22:$R$103,2,0)=\"\",\"\",VLOOKUP($A143,'Entry form Page 2'!$B$22:$R$103,2,0)),\"\")","v":""},{"$f":"SUMIF('Entry form Page 2'!$C$22:$C$103,$B143,'Entry form Page 2'!$R$22:$R$103)","v":0},null,0]
[141,{"$f":"IFERROR(IF(VLOOKUP($A144,'Entry form Page 2'!$B$22:$R$103,2,0)=\"\",\"\",VLOOKUP($A144,'Entry form Page 2'!$B$22:$R$103,2,0)),\"\")","v":""},{"$f":"SUMIF('Entry form Page 2'!$C$22:$C$103,$B144,'Entry form Page 2'!$R$22:$R$103)","v":0},null,0]
[142,{"$f":"IFERROR(IF(VLOOKUP($A145,'Entry form Page 2'!$B$22:$R$103,2,0)=\"\",\"\",VLOOKUP($A145,'Entry form Page 2'!$B$22:$R$103,2,0)),\"\")","v":""},{"$f":"SUMIF('Entry form Page 2'!$C$22:$C$103,$B145,'Entry form Page 2'!$R$22:$R$103)","v":0},null,0]
[143,{"$f":"IFERROR(IF(VLOOKUP($A146,'Entry form Page 2'!$B$22:$R$103,2,0)=\"\",\"\",VLOOKUP($A146,'Entry form Page 2'!$B$22:$R$103,2,0)),\"\")","v":""},{"$f":"SUMIF('Entry form Page 2'!$C$22:$C$103,$B146,'Entry form Page 2'!$R$22:$R$103)","v":0},null,0]
[144,{"$f":"IFERROR(IF(VLOOKUP($A147,'Entry form Page 2'!$B$22:$R$103,2,0)=\"\",\"\",VLOOKUP($A147,'Entry form Page 2'!$B$22:$R$103,2,0)),\"\")","v":""},{"$f":"SUMIF('Entry form Page 2'!$C$22:$C$103,$B147,'Entry form Page 2'!$R$22:$R$103)","v":0},null,0]
[145,{"$f":"IFERROR(IF(VLOOKUP($A148,'Entry form Page 2'!$B$22:$R$103,2,0)=\"\",\"\",VLOOKUP($A148,'Entry form Page 2'!$B$22:$R$103,2,0)),\"\")","v":""},{"$f":"SUMIF('Entry form Page 2'!$C$22:$C$103,$B148,'Entry form Page 2'!$R$22:$R$103)","v":0},null,0]
[146,{"$f":"IFERROR(IF(VLOOKUP($A149,'Entry form Page 2'!$B$22:$R$103,2,0)=\"\",\"\",VLOOKUP($A149,'Entry form Page 2'!$B$22:$R$103,2,0)),\"\")","v":""},{"$f":"SUMIF('Entry form Page 2'!$C$22:$C$103,$B149,'Entry form Page 2'!$R$22:$R$103)","v":0},null,0]
[147,{"$f":"IFERROR(IF(VLOOKUP($A150,'Entry form Page 2'!$B$22:$R$103,2,0)=\"\",\"\",VLOOKUP($A150,'Entry form Page 2'!$B$22:$R$103,2,0)),\"\")","v":""},{"$f":"SUMIF('Entry form Page 2'!$C$22:$C$103,$B150,'Entry form Page 2'!$R$22:$R$103)","v":0},null,0]
[148,{"$f":"IFERROR(IF(VLOOKUP($A151,'Entry form Page 2'!$B$22:$R$103,2,0)=\"\",\"\",VLOOKUP($A151,'Entry form Page 2'!$B$22:$R$103,2,0)),\"\")","v":""},{"$f":"SUMIF('Entry form Page 2'!$C$22:$C$103,$B151,'Entry form Page 2'!$R$22:$R$103)","v":0},null,0]
[149,{"$f":"IFERROR(IF(VLOOKUP($A152,'Entry form Page 2'!$B$22:$R$103,2,0)=\"\",\"\",VLOOKUP($A152,'Entry form Page 2'!$B$22:$R$103,2,0)),\"\")","v":""},{"$f":"SUMIF('Entry form Page 2'!$C$22:$C$103,$B152,'Entry form Page 2'!$R$22:$R$103)","v":0},null,0]
[150,{"$f":"IFERROR(IF(VLOOKUP($A153,'Entry form Page 2'!$B$22:$R$103,2,0)=\"\",\"\",VLOOKUP($A153,'Entry form Page 2'!$B$22:$R$103,2,0)),\"\")","v":""},{"$f":"SUMIF('Entry form Page 2'!$C$22:$C$103,$B153,'Entry form Page 2'!$R$22:$R$103)","v":0},null,0]
[151,{"$f":"IFERROR(IF(VLOOKUP($A154,'Entry form Page 2'!$B$22:$R$103,2,0)=\"\",\"\",VLOOKUP($A154,'Entry form Page 2'!$B$22:$R$103,2,0)),\"\")","v":""},{"$f":"SUMIF('Entry form Page 2'!$C$22:$C$103,$B154,'Entry form Page 2'!$R$22:$R$103)","v":0},null,0]
[152,{"$f":"IFERROR(IF(VLOOKUP($A155,'Entry form Page 2'!$B$22:$R$103,2,0)=\"\",\"\",VLOOKUP($A155,'Entry form Page 2'!$B$22:$R$103,2,0)),\"\")","v":""},{"$f":"SUMIF('Entry form Page 2'!$C$22:$C$103,$B155,'Entry form Page 2'!$R$22:$R$103)","v":0},null,0]
[153,{"$f":"IFERROR(IF(VLOOKUP($A156,'Entry form Page 2'!$B$22:$R$103,2,0)=\"\",\"\",VLOOKUP($A156,'Entry form Page 2'!$B$22:$R$103,2,0)),\"\")","v":""},{"$f":"SUMIF('Entry form Page 2'!$C$22:$C$103,$B156,'Entry form Page 2'!$R$22:$R$103)","v":0},null,0]
[154,{"$f":"IFERROR(IF(VLOOKUP($A157,'Entry form Page 2'!$B$22:$R$103,2,0)=\"\",\"\",VLOOKUP($A157,'Entry form Page 2'!$B$22:$R$103,2,0)),\"\")","v":""},{"$f":"SUMIF('Entry form Page 2'!$C$22:$C$103,$B157,'Entry form Page 2'!$R$22:$R$103)","v":0},null,0]
[155,{"$f":"IFERROR(IF(VLOOKUP($A158,'Entry form Page 2'!$B$22:$R$103,2,0)=\"\",\"\",VLOOKUP($A158,'Entry form Page 2'!$B$22:$R$103,2,0)),\"\")","v":""},{"$f":"SUMIF('Entry form Page 2'!$C$22:$C$103,$B158,'Entry form Page 2'!$R$22:$R$103)","v":0},null,0]
[156,{"$f":"IFERROR(IF(VLOOKUP($A159,'Entry form Page 2'!$B$22:$R$103,2,0)=\"\",\"\",VLOOKUP($A159,'Entry form Page 2'!$B$22:$R$103,2,0)),\"\")","v":""},{"$f":"SUMIF('Entry form Page 2'!$C$22:$C$103,$B159,'Entry form Page 2'!$R$22:$R$103)","v":0},null,0]
[157,{"$f":"IFERROR(IF(VLOOKUP($A160,'Entry form Page 2'!$B$22:$R$103,2,0)=\"\",\"\",VLOOKUP($A160,'Entry form Page 2'!$B$22:$R$103,2,0)),\"\")","v":""},{"$f":"SUMIF('Entry form Page 2'!$C$22:$C$103,$B160,'Entry form Page 2'!$R$22:$R$103)","v":0},null,0]
[158,{"$f":"IFERROR(IF(VLOOKUP($A161,'Entry form Page 2'!$B$22:$R$103,2,0)=\"\",\"\",VLOOKUP($A161,'Entry form Page 2'!$B$22:$R$103,2,0)),\"\")","v":""},{"$f":"SUMIF('Entry form Page 2'!$C$22:$C$103,$B161,'Entry form Page 2'!$R$22:$R$103)","v":0},null,0]
[159,{"$f":"IFERROR(IF(VLOOKUP($A162,'Entry form Page 2'!$B$22:$R$103,2,0)=\"\",\"\",VLOOKUP($A162,'Entry form Page 2'!$B$22:$R$103,2,0)),\"\")","v":""},{"$f":"SUMIF('Entry form Page 2'!$C$22:$C$103,$B162,'Entry form Page 2'!$R$22:$R$103)","v":0},null,0]
[160,{"$f":"IFERROR(IF(VLOOKUP($A163,'Entry form Page 2'!$B$22:$R$103,2,0)=\"\",\"\",VLOOKUP($A163,'Entry form Page 2'!$B$22:$R$103,2,0)),\"\")","v":""},{"$f":"SUMIF('Entry form Page 2'!$C$22:$C$103,$B163,'Entry form Page 2'!$R$22:$R$103)","v":0},null,0]
[161,{"$f":"IFERROR(IF(VLOOKUP($A164,'Entry form Page 2'!$B$22:$R$103,2,0)=\"\",\"\",VLOOKUP($A164,'Entry form Page 2'!$B$22:$R$103,2,0)),\"\")","v":""},{"$f":"SUMIF('Entry form Page 2'!$C$22:$C$103,$B164,'Entry form Page 2'!$R$22:$R$103)","v":0},null,0]
[162,{"$f":"IFERROR(IF(VLOOKUP($A165,'Entry form Page 2'!$B$22:$R$103,2,0)=\"\",\"\",VLOOKUP($A165,'Entry form Page 2'!$B$22:$R$103,2,0)),\"\")","v":""},{"$f":"SUMIF('Entry form Page 2'!$C$22:$C$103,$B165,'Entry form Page 2'!$R$22:$R$103)","v":0},null,{"$f":"IF(C165=\"\",\"\",C165-D165)","v":0}]
[163,{"$f":"IFERROR(IF(VLOOKUP($A166,'Entry form Page 2'!$B$22:$R$103,2,0)=\"\",\"\",VLOOKUP($A166,'Entry form Page 2'!$B$22:$R$103,2,0)),\"\")","v":""},{"$f":"SUMIF('Entry form Page 2'!$C$22:$C$103,$B166,'Entry form Page 2'!$R$22:$R$103)","v":0},null,0]

{"sheet":"INFO","index":3,"n_rows":55,"n_cols":18,"rows_kept":55,"cut":false,"hidden":true,"merged":[]}
["Team",null,"Divisions",null,"Weight info","Under","Over"]
["Children *","Kata  & Kumite","Belt & Age",null,"Children Girls",null,null,null,{"$f":"IF($F2=\"\",\"\",$E2&\" \"&F$1&\" \"&$F2&\" kg\")","v":""},{"$f":"IF(I2=\"\",\"\",IF(G2=\"\",$E2&\" \"&G$1&\" \"&$F2&\" kg\",$E2&\" \"&G$1&\" \"&$F2&\" \"&F$1&\" \"&G2&\" kg\"))","v":""},{"$f":"IF(I2=\"\",\"\",IF(G2=\"\",\"\",$E2&\" \"&G$1&\" \"&$G2&\" kg\"))","v":""}]
["Cadet *","Kata  & Kumite","Open *",null,"Children Boys",null,null,null,{"$f":"IF($F3=\"\",\"\",$E3&\" \"&F$1&\" \"&$F3&\" kg\")","v":""},{"$f":"IF(I3=\"\",\"\",IF(G3=\"\",$E3&\" \"&G$1&\" \"&$F3&\" kg\",$E3&\" \"&G$1&\" \"&$F3&\" \"&F$1&\" \"&G3&\" kg\"))","v":""},{"$f":"IF(I3=\"\",\"\",IF(G3=\"\",\"\",$E3&\" \"&G$1&\" \"&$G3&\" kg\"))","v":""}]
["Junior *","Kumite","Weight",null,"Cadet Female",50,null,null,"Cadet Female Under 50 kg","Cadet Female Over 50 kg",""]
["Senior *","Superkata","Superkata *",null,"Cadet Male",50,null,null,"Cadet Male Under 50 kg","Cadet Male Over 50 kg",""]
[null,null,null,null,"Junior Female",60,null,null,"Junior Female Under 60 kg","Junior Female Over 60 kg",""]
[null,null,null,null,"Junior Male",60,null,null,"Junior Male Under 60 kg","Junior Male Over 60 kg",""]
[null,null,null,null,"Senior Female",60,null,null,"Senior Female Under 60 kg","Senior Female Over 60 kg",""]
[null,null,null,null,"Senior Male",75,null,null,"Senior Male Under 75 kg","Senior Male Over 75 kg",""]
[]
[]
[]
[]
["Cadet *"]
["Junior *"]
["Veteran *"]
[]
[null,null,null,5,6,7,8,9,10,11,12,13,null,14,15,16,17,18]
[null,"White","White",5,6,7,"8 - 9","8 - 9","10 - 11","10 - 11","12 - 13","12 - 13","White to Orange"]
[null,"Yellow","Yellow",null,"6-7","6-7","8 - 9","8 - 9","10 - 11","10 - 11","12 - 13","12 - 13","White to Orange"]
[null,"Orange","Orange",null,null,"7 - 9","7 - 9","7 - 9","10 - 11","10 - 11","12 - 13","12 - 13","White to Orange"]
[null,"Green","Green to Blue",null,null,null,"8 - 9","8 - 9","10 - 11","10 - 11","12 - 13","12 - 13"]
[null,"Blue","Green to Blue",null,null,null,"8 - 9","8 - 9","10 - 11","10 - 11","12 - 13","12 - 13"]
[null,"Purple","Purple to Red",null,null,null,null,null,"10 - 11","10 - 11","12 - 13","12 - 13"]
[null,"Red","Purple to Red",null,null,null,null,null,"10 - 11","10 - 11","12 - 13","12 - 13"]
[null,"Brown","Brown to Black",null,null,null,null,null,"10 - 11","10 - 11","12 - 13","12 - 13"]
[null,"Black","Brown to Black",null,null,null,null,null,"10 - 11","10 - 11","12 - 13","12 - 13"]
[null,null,null,"Male Development White - Orange 14-17 Years Kata"]
[null,null,null,"Male Development White - Orange 14-17 Years Kumite"]
[null,null,null,"Male Development Green - Purple 14-17 Years Kata"]
[null,null,null,"Male Development Green - Purple 14-17 Years Kumite"]
[null,null,null,"Male Development White - Green 18 and Older Kata"]
[null,null,null,"Male Development White - Green 18 and Older Kumite"]
[null,null,null,"Male Development Purple - Brown 18 and Older Kata"]
[null,null,null,"Male Development Purple - Brown 18 and Older Kumite"]
[null,null,null,"Men Junior Opens Kata"]
[null,null,null,"Men Junior Opens Kumite"]
[null,null,null,"Men Junior Kumite Under 60 kg"]
[null,null,null,"Men Junior Kumite Over 60kg"]
[null,null,null,"Men Senior Opens Kata"]
[null,null,null,"Men Senior Opens Kumite"]
[null,null,null,"Men Senior Opens Kumite"]
[null,null,null,"Men Senior Opens Kumite"]
[null,null,null,"Men Senior Kumite Under 75 kg"]
[null,null,null,"Men Senior Kumite Over 75kg"]
[]
[null,"White","White"]
[null,"Yellow","Yellow to Orange"]
[null,"Orange","Yellow to Orange"]
[null,"Green","Green to Purple"]
[null,"Blue","Green to Purple"]
[null,"Purple","Green to Purple"]
[null,"Red","Red to Black"]
[null,"Brown","Red to Black"]
[null,"Black","Red to Black"]

{"sheet":"Instructions","index":4,"n_rows":31,"n_cols":3,"rows_kept":31,"cut":false,"hidden":false,"merged":[[9,2,9,18],[26,2,26,18],[31,2,31,18],[27,2,27,18],[30,2,30,18],[28,2,28,18],[25,2,25,18],[11,2,11,18],[12,2,12,18],[10,2,10,18],[19,2,19,18],[18,2,18,18],[21,2,21,18],[20,2,20,18],[24,2,24,18],[13,2,13,18],[0,2,0,18],[1,2,1,18],[7,2,7,18],[6,2,6,18],[8,2,8,18],[4,2,4,18],[2,2,2,18],[3,2,3,18],[5,2,5,18],[14,2,14,18],[15,2,15,18],[22,2,22,18],[16,2,16,18],[17,2,17,18]]}
[null,null,"Instructions"]
[null,null,"Please complete the areas with your Dojo's information, contact details etc."]
[null,null,"White blocks require you to type in information; Orange blocks require you to make a selection from the drop down list supplied (little triangle); Blue blocks are information - no input from you required"]
[null,null,"Enter one line PER student PER division.   ( If the student will be competing in Kata & Kumite, that means 2 lines will be completed.)  IF the student is competing in the Team events, please enter it as his/her last event.  Please, if possible, enter all the events per particular students before starting with a next student.                     "]
[]
[null,null,"1.   NAME  & DOB (dd/mm/yy):     Type in the student's name and Date of Birth (day/month/year) please.  (These blocks are White) "]
[null,null,"2.   GENDER:     Select the gender of the student  (This block is Orange)"]
[null,null,"3.  AGE:              The system will automatically calculate the students age (date of competition)  (This block is Blue)"]
[null,null,"4.  BELT:             Select the Belt of the student  (This block is Orange)"]
[null,null,"5.  CLUB:            The Club information are automatically pulled through from the information that you've already entered (This block is Blue)"]
[null,null,"6.  CATEGORY: Select the category that the student will be competing in (in an Individual event or in a Team event) (This block is Orange)"]
[null,null,"7.  EVENT:          Select the Event that the student will be competing in (Kata, Kumite or Superkata).  Please note that Team events are split between Kata Team event and Kumite Team event.  (This block is Orange)"]
[null,null,"8.  DIVISION:    Select the Division that the student will be competing in, see 8.1 to 8.4 :   (This block is Orange). "]
[null,null,"8. 1  For Kata there is Opens (any belt or  age per group as per initiation) and Belt & Age (e.g. Blue belts age 8-9 boys);   "]
[null,null,"8.2.1  For Kumite there is Opens (ANY belt, WEIGHT or  age per group as per invitiation); "]
[null,null,"8.2.2  For Kumite there is also Weight (any belt, within a certain weight & age category, as per invitation) "]
[null,null,"8.2.3  For Kumite there is also Belt & Age (this is any weight, per belt colour and age group as per invitation);   "]
[null,null,"8.3  For Superkata only Superkate *.  This is an Opens Division, all ages and belts compete against each other."]
[null,null,"8.3  For Team events there is only Opens * division."]
[null,null,"PLEASE NOTE THAT AGE CUT OFF DATE FOR OPEN DIVISIONS, IS THE DATE OF THE LAST KARATE SUPER LEAGUE COMPETITION FOR THIS YEAR"]
[null,null,"9.   WHEIGHT CATEGORY  (This block is Orange)"]
[null,null,"9.1    Where you've selected Kumite per Weight Division, the different weight categories are displayed in the drop down list, please select the category you student wants to compete in. "]
[null,null,"10.  CATEGORY (This block is Orange)"]
[null,null,"10.1  Where you've selected Individual Open Division, the Division that you will be competing in, will be displayed in the drop down list, please select the category."]
[null,null,"10.2   Only in Team events, Cadet's and Juniors have the option to also enter in the Senior's Team event.  Select the division from the drop down box."]
[null,null,"11.  KATA and KUMITE:    Based on your Event category , the following 2 columns (Kata & Kumite) will automatically be updated with an X/T/S.  (These Block are blue and grey)"]
[null,null,"12. FEE CATEGORY:        Based on the students number of entries, the number of divisions are calculated.  Team events are not calculated as a division, but a separate 'event'.  You do not need to enter any information, it is automatically calculated.  (This block is Blue)"]
[null,null,"13.  FEE:                              Based on the number of Divisions and/or Team event, the system calculated the fee payable by the student  (This block is Blue)"]
[null,null,"14.  TEAM NAME:           If you have selected Team event, this Block will Change colour to White.  Please enter your Team's name in here. "]
[null,null,"PLEASE ENTER YOUR TEAM RESERVE'S DETAILS AT THE END OF THE ENTRY SHEET, AFTER ROW 136"]
[null,null,"To assist you with managing the fees that are due for this completion, we've attached a sheet called \"Fee\" on this spread sheet.  It will automatically bring the information captured on this entry form across, with the fee that are due per student.  There is a column, where you can enter the amount paid by student and it will then calculate the balance owed by the student."]

{"sheet":"Tournament info","index":5,"n_rows":6,"n_cols":5,"rows_kept":6,"cut":false,"hidden":true,"merged":[]}
[]
["Cutt off date",null,"2015-11-01"]
[]
["Challenge name:",null,"LIONS",null,{"$f":"C4&\" Challenge\"","v":"LIONS Challenge"}]
[]
["Date of Tournament",null,"2015-08-15"]

{"sheet":"Sheet1","index":6,"n_rows":0,"n_cols":0,"rows_kept":0,"cut":false,"hidden":false,"merged":[]}

{"sheet":"Sheet2","index":7,"n_rows":0,"n_cols":0,"rows_kept":0,"cut":false,"hidden":false,"merged":[]}